program: Gaussian 09
title: 000136895
version: EM64L-G09RevD.01
frameworkgroup: C1[X(C6H8N2O)]
method: RPBEPBE
basis: SDD
operation: Freq
keyword: #pfreq=noraman
keyword: PBEPBE/SDD
title: #p freq=noraman PBEPBE/SDD
converged: YES YES NO NO
title: Mulliken charges:
elementType: O N N C C C C C C H H H H H H H H
charge: -0.380576 -0.093691 -0.100317 0.147618 -0.257782 -0.271269 -0.182818 -0.191933 -0.708185 0.254244 0.241504 0.261239 0.259403 0.209477 0.199748 0.241995 0.371344
chargesum: 0.00000
title: Mulliken charges with hydrogens summed into heavy atoms:
elementType: O N N C C C C C C
charge: -0.009232 -0.093691 -0.100317 0.147618 -0.003538 -0.029764 0.078420 0.067470 -0.056965
polarizability: 1.45833061e+02 -7.40924855e-01 7.55629580e+01 -3.36323756e+00 3.05379565e-01 4.18462191e+01
1716.lowfreq: -9.0298 -5.1660 0.0008 0.0010 0.0010 11.1910 77.8347 103.9076 162.6985
frequency: 77.8197 103.8877 162.6947 210.8120 244.5959 304.8556 364.0894 409.6628 416.6891 459.8589 523.7403 633.3221 665.3653 706.4263 758.5138 775.7563 801.5347 921.4404 941.1292 967.7565 1005.7910 1048.8508 1063.6128 1074.3781 1128.0629 1186.4217 1262.0953 1320.6557 1334.9077 1388.3407 1404.9371 1414.9905 1462.3079 1483.0476 1548.2712 1561.5144 1646.9045 2901.5313 2970.6379 3067.5983 3165.2258 3174.5516 3189.9651 3202.6891 3468.6407
redmass: 3.6783 1.1503 4.1615 3.3120 3.5558 1.4299 2.9856 3.5297 3.8101 3.1800 4.0401 6.6869 2.7310 5.1044 1.3048 5.6139 2.0418 1.2738 1.2717 3.0956 4.8856 1.3644 3.7041 1.6102 1.4139 1.1536 1.6786 1.1968 1.8536 1.6937 1.2970 3.9564 1.0829 1.0486 6.0538 7.0694 6.5099 1.0394 1.0973 1.0930 1.0865 1.0880 1.0988 1.1001 1.0686
irintensity: 0.0856 3.2025 5.5884 4.0637 27.1007 122.7782 8.0174 11.4647 11.3463 6.7029 2.2027 0.5218 44.8226 28.8896 0.4177 18.3142 91.1471 1.2879 1.1135 4.4331 4.4389 0.7451 7.8801 7.5604 5.9334 24.5008 8.7912 82.1615 16.1066 54.1291 14.0399 28.7668 2.5385 10.2888 22.6696 49.8853 173.4888 116.2822 64.8458 49.2637 1.2895 0.9693 6.8303 2.4660 27.9691
temp: 298.150 k
press: 1.00000 atm
elementType: 8 7 7 6 6 6 6 6 6 1 1 1 1 1 1 1 1
symmnumber: 1
zpe: 346473.7 jmol-1
zpe.correction: 0.131965 hartree
zpe.thermalcorrener: 0.140791 hartree
zpe.thermalcorrenthalpy: 0.141735 hartree
zpe.thermalcorrgfe: 0.098388 hartree
zpe.sumelectzpe: -417.396971 hartree
zpe.sumelectthermal: -417.388146 hartree
zpe.sumelectthermalent: -417.387201 hartree
zpe.sumelectthermalfe: -417.430548 hartree
dipole: 3.6721 -2.0300 -1.5042
dipole: 4.4573
quadrupole: -48.5472 -48.8974 -56.1101
quadrupole: 5.7574 -6.4882 0.6363
quadrupole: 2.6377 2.2875 -4.9252 5.7574 -6.4882 0.6363
hfenergy: -417.5289363 hartree
pointgroup: C01 [X(C6H8N2O1)]
dipole: 1.4500864 -0.7581655 -0.6306475 debye
dipolederiv: -0.7104187 0.017773 0.0212901 0.0396047 -0.4516109 -0.0268599 -0.3114781 -0.0060477 0.0938355 -0.1419944 -0.1025319 0.0927784 -0.0720673 -0.4081449 -0.0023472 0.7650034 -0.0256282 -0.19943 -1.0570182 -0.0170615 0.0199497 0.2702819 -0.2682772 -0.0212116 -0.0055443 -0.0033199 -0.3834339 0.960541 -0.0831661 -0.0089832 -0.2720252 0.157409 0.0126253 0.0038945 0.0037064 0.1087095 -0.4074045 0.021182 0.014257 -0.1730355 0.0089273 0.0229216 -0.0751629 0.0004869 -0.1808934 -0.5742919 0.0064481 0.017647 0.3875691 -0.085616 -0.0296883 -0.0531561 0.0044044 -0.1945025 0.3502062 -0.1664222 -0.0867361 -0.4973611 0.3754674 0.077086 -0.2349588 0.0420971 -0.0932603 0.6889278 0.2396093 -0.109696 0.4771219 0.2736859 -0.0505429 -0.2331282 -0.0149684 -0.0428741 0.5659031 0.0604759 -0.0157138 0.134246 0.1343909 0.013392 0.0278123 0.0155863 0.2588179 0.0843257 0.0604766 0.0053472 -0.0024091 -0.0310203 -0.0072792 0.0256606 0.0018895 0.1567331 0.0418601 -0.0899926 0.0089099 -0.0379478 -0.0299543 0.0028886 0.0309511 -0.0111073 0.159456 0.0304641 -0.0800097 0.0080706 -0.0518123 0.0365288 -0.0056393 0.0417269 -0.0152643 0.1863791 0.0498119 0.0768443 0.009595 0.05273 0.0017393 -0.0002735 0.0375442 0.0078837 0.1722558 -0.0018201 -0.0072275 -0.0396185 -0.1891278 -0.0433514 0.1341473 0.0723503 0.1370303 -0.1221894 -0.0100585 0.0161104 0.067421 -0.1683814 -0.096865 -0.1422491 -0.0600666 -0.1503211 -0.0825734 -0.2223027 0.0398555 -0.013898 0.1007998 0.0675009 0.0081573 -0.02657 0.0010954 0.0984145 0.353269 0.0076363 0.0093798 0.001814 0.3591906 0.0148731 -0.0048784 0.0124769 0.0645554 unknown
polarizability: 145.6513708|0.9168939|75.5550741|-5.4634367|0.6232492|42.035793 unknown
InChI: InChI=1S/C6H8N2O/c1-7-6-2-4-8(9)5-3-6/h2-5,9H,1H3
charge 0 multiplicity 1
17 atoms
O  3.202486 -0.324109 0.100929
N  1.793385 -0.134304 -0.212337
N  -2.332038 0.516041 0.026996
C  -1.033527 0.235435 -0.005143
C  -0.078937 1.354679 0.005011
C  -0.398346 -1.102391 -0.026957
C  1.278576 1.162925 -0.068644
C  0.96835 -1.251755 -0.097279
C  -3.286684 -0.612306 0.035883
H  -0.487831 2.366272 0.06956
H  -1.014513 -2.004627 0.017742
H  2.019333 1.964245 -0.046654
H  1.484176 -2.214726 -0.087826
H  -3.234178 -1.204874 0.976408
H  -3.137548 -1.324968 -0.807121
H  -4.309498 -0.207355 -0.043907
H  3.658695 -0.338385 -0.786462
