program: Gaussian 09
title: 000136891
version: EM64L-G09RevD.01
frameworkgroup: C1[X(C7H8O)]
method: RPBEPBE
basis: SDD
operation: Freq
keyword: #p
keyword: freq=noraman
keyword: PBEPBE/SDD
title: #p freq=noraman PBEPBE/SDD
converged: YES YES NO NO
title: Mulliken charges:
elementType: O C C C C C C C H H H H H H H H
charge: -0.186908 -0.568460 -0.570743 0.210970 -0.165570 -0.166208 -0.224550 -0.223959 0.250166 0.252459 0.250013 0.251895 0.229166 0.229866 0.215867 0.215993
chargesum: 0.00000
title: Mulliken charges with hydrogens summed into heavy atoms:
elementType: O C C C C C C C
charge: -0.186908 -0.065834 -0.068834 0.210970 0.063597 0.063658 -0.008682 -0.007965
polarizability: 9.42212180e+01 6.65239386e-02 8.10758731e+01 -4.57106401e-02 3.36837312e+00 4.79173745e+01
1716.lowfreq: 0.0009 0.0010 0.0014 17.7759 19.7449 26.7536 57.0740 199.7894 301.7013
frequency: 56.2002 199.7700 301.6907 334.9337 336.2965 453.7444 516.6494 522.5564 585.0732 692.3525 714.4628 805.8497 812.5298 912.4885 923.6410 947.0296 959.4270 966.5968 988.2416 1052.6774 1141.8961 1145.1259 1215.6562 1217.2577 1229.7682 1290.2986 1292.2476 1359.4819 1408.9039 1425.4546 1429.6011 1597.7723 1630.0672 1650.4363 2939.2176 2940.1304 3080.4521 3083.0630 3094.6996 3106.4939 3131.4787 3138.7537
redmass: 3.8300 2.1013 2.7061 3.3194 4.4239 4.3114 2.5871 2.0645 3.5867 1.3053 2.8191 1.7107 2.9895 2.8025 2.2603 2.7037 1.3656 1.4156 2.6369 1.8149 1.1286 2.5976 1.1592 1.2018 1.3028 1.3610 1.4121 1.3591 1.5313 1.2149 1.1036 8.7335 5.6316 9.3911 1.0672 1.0666 1.0906 1.0910 1.0843 1.0870 1.0961 1.0988
irintensity: 4.6840 0.2370 3.1973 3.2206 1.4462 2.1409 5.0960 2.5614 2.2998 131.9177 14.4492 10.6285 9.6996 10.3231 0.0216 2.0159 3.6753 1.1831 4.9490 15.2572 8.3696 23.3983 6.2470 8.5848 7.6186 3.5724 9.6749 1.2494 0.5797 0.1159 36.2094 105.0822 0.3539 174.0577 7.5573 6.7157 10.4789 8.5671 2.4016 12.7111 46.6160 19.3402
temp: 298.150 k
press: 1.00000 atm
elementType: 8 6 6 6 6 6 6 6 1 1 1 1 1 1 1 1
symmnumber: 1
zpe: 338725.4 jmol-1
zpe.correction: 0.129014 hartree
zpe.thermalcorrener: 0.136075 hartree
zpe.thermalcorrenthalpy: 0.137019 hartree
zpe.thermalcorrgfe: 0.097514 hartree
zpe.sumelectzpe: -346.137179 hartree
zpe.sumelectthermal: -346.130118 hartree
zpe.sumelectthermalent: -346.129174 hartree
zpe.sumelectthermalfe: -346.168678 hartree
dipole: 2.7796 0.0180 0.0195
dipole: 2.7797
quadrupole: -55.6592 -42.7283 -47.1150
quadrupole: -0.0181 -0.0832 1.3240
quadrupole: -7.1584 5.7726 1.3858 -0.0181 -0.0832 1.3240
hfenergy: -346.2661925 hartree
pointgroup: C01 [X(C7H8O1)]
dipole: -1.0600274 0.0568842 -0.2628879 debye
dipolederiv: -1.1961863 0.043497 -0.2212781 0.050445 -0.4068628 -0.033562 -0.2295653 -0.0033014 -0.3504754 -0.2637899 0.2361339 -0.0568785 0.3746216 -0.1510087 -0.0044325 -0.0797314 -0.0579307 -0.0202143 -0.3212064 -0.1710436 -0.0947941 -0.3193805 -0.0914929 -0.1683192 -0.0661635 -0.1493616 -0.0225893 1.3282837 -0.0764035 0.2958632 -0.0853452 0.6955837 0.2188689 0.3023961 0.1621257 0.2438422 0.1806544 0.0041702 0.1804826 0.1105478 -0.1092744 -0.1477316 0.2902697 -0.0948272 0.0229791 0.3394869 0.0030549 -0.0349129 -0.068554 -0.10354 -0.1798272 -0.1451175 -0.0791447 -0.1398005 -0.1412779 -0.0159438 0.0995706 -0.1016768 0.025217 -0.1302894 0.1582946 -0.1515396 -0.0515728 -0.0025206 0.0851836 -0.089971 0.1546337 0.009224 -0.0567416 -0.1492169 -0.1108101 -0.1773436 -0.0044007 -0.0944146 -0.0397368 -0.0715931 -0.0391771 -0.0165965 -0.0421406 0.0008012 0.0979518 0.0546578 0.0017879 0.0545792 -0.0193993 0.0939815 0.0667552 -0.0186408 0.0086792 -0.0320068 -0.0029999 0.0830848 -0.0121522 0.0696207 -0.0555134 0.0121232 -0.009426 0.0366778 0.1111428 0.0528583 -0.0020314 -0.0075738 -0.0121112 0.0903959 0.074413 0.0602876 0.0054328 -0.0268202 0.0931882 -0.0508193 -0.0323422 -0.0284935 -0.03767 0.1198976 -0.08246 0.1364699 0.0558082 0.0357 -0.0215184 0.0335625 -0.0360859 -0.0376488 0.1140155 0.0844013 0.1351559 0.1142637 -0.0317271 0.0366249 -0.1241045 0.0400223 0.0541462 0.0816146 -0.1107789 0.0959463 0.0473396 -0.1207206 -0.0613625 0.049686 -0.0572515 0.0636397 0.049812 0.0375916 0.0656265 0.1274955 unknown
polarizability: 91.8736797|0.8164526|80.1446228|9.9726822|-6.4996976|51.1961632 unknown
InChI: InChI=1S/C7H8O/c8-7-5-3-1-2-4-6-7/h1-4H,5-6H2
charge 0 multiplicity 1
16 atoms
O  2.608529 -0.159292 0.852655
C  0.567786 1.192108 0.721903
C  0.627023 -1.307871 -0.022558
C  1.395697 -0.098502 0.548535
C  -0.493253 1.471195 -0.318912
C  -0.803649 -1.480546 0.436651
C  -1.601854 0.686831 -0.521476
C  -1.816352 -0.599902 0.146679
H  1.26846 2.035394 0.835714
H  0.065276 1.04188 1.705112
H  1.230974 -2.212838 0.15312
H  0.621864 -1.113413 -1.11963
H  -0.390999 2.405639 -0.88529
H  -1.040007 -2.409784 0.970447
H  -2.388419 1.049462 -1.197905
H  -2.848678 -0.88056 0.398253
