program: Gaussian 09
title: 000136887
version: EM64L-G09RevD.01
frameworkgroup: C1[X(C7H10O)]
method: RPBEPBE
basis: SDD
operation: Freq
keyword: #pfreq=noraman
keyword: PBEPBE/SDD
title: #p freq=noraman PBEPBE/SDD
converged: YES YES NO NO
title: Mulliken charges:
elementType: O C C C C C C C H H H H H H H H H H
charge: -0.219109 -0.414734 -0.486012 -0.436653 0.299091 0.069812 -0.304101 -0.774705 0.213326 0.217255 0.246942 0.226469 0.221872 0.224874 0.220672 0.242520 0.208509 0.243970
chargesum: 0.00000
title: Mulliken charges with hydrogens summed into heavy atoms:
elementType: O C C C C C C C
charge: -0.219109 0.015847 -0.012601 0.010094 0.299091 0.069812 -0.083428 -0.079705
polarizability: 9.05251936e+01 9.51157264e+00 8.33809066e+01 2.15699454e+00 6.61896394e-01 5.12649294e+01
1716.lowfreq: -9.7457 0.0003 0.0007 0.0010 4.0082 12.5435 86.0882 136.6251 193.1864
frequency: 86.0596 136.5995 193.1861 282.7983 291.0345 329.7708 401.6809 463.3400 506.0846 593.1128 676.0736 700.4951 797.1518 857.0519 878.1986 896.4211 953.2634 1030.8121 1043.3167 1060.2580 1100.0324 1112.2663 1136.0304 1174.5722 1237.7439 1257.6089 1314.8328 1335.3143 1351.6600 1363.8082 1401.3875 1438.2274 1450.5689 1454.2945 1468.1584 1473.4091 1580.0736 1650.6350 2944.5170 2965.0293 2986.4868 2989.9453 3016.9085 3051.8527 3064.6136 3068.2448 3092.2042 3095.8085
redmass: 3.3383 1.0490 2.1826 1.7629 3.2314 2.8079 4.0129 3.2970 4.2510 2.5221 3.7015 2.8676 1.3149 2.4319 2.2144 1.4041 2.2206 1.5882 1.5374 1.9093 1.7340 1.9091 1.3807 2.0730 1.2323 1.5670 1.3852 1.7141 1.4558 2.4112 1.2554 1.0865 1.0458 1.0913 1.0703 1.0872 10.2751 6.4906 1.0669 1.0668 1.0362 1.0626 1.0897 1.1015 1.0952 1.0966 1.0971 1.0950
irintensity: 3.9058 0.5488 0.4009 3.5573 6.3102 1.4437 2.9811 2.0908 4.6249 0.5071 3.0763 5.2454 3.5086 6.6513 13.4548 9.8083 2.0656 15.0236 7.3446 3.2236 14.0262 20.5775 5.3763 10.6273 0.3771 7.3162 1.7410 7.5958 2.3953 37.7927 19.4352 12.1541 10.1184 16.0292 10.1398 13.0832 175.3005 19.3669 25.1088 13.1888 23.8289 27.4817 43.9241 43.8935 21.2819 16.0691 1.6873 44.8657
temp: 298.150 k
press: 1.00000 atm
elementType: 8 6 6 6 6 6 6 6 1 1 1 1 1 1 1 1 1 1
symmnumber: 1
zpe: 399271.3 jmol-1
zpe.correction: 0.152074 hartree
zpe.thermalcorrener: 0.159934 hartree
zpe.thermalcorrenthalpy: 0.160879 hartree
zpe.thermalcorrgfe: 0.119938 hartree
zpe.sumelectzpe: -347.343350 hartree
zpe.sumelectthermal: -347.335490 hartree
zpe.sumelectthermalent: -347.334546 hartree
zpe.sumelectthermalfe: -347.375486 hartree
dipole: -2.8173 -2.7074 -0.2892
dipole: 3.9180
quadrupole: -48.2862 -50.5373 -48.0303
quadrupole: -5.2939 0.2291 -0.2087
quadrupole: 0.6651 -1.5860 0.9210 -5.2939 0.2291 -0.2087
hfenergy: -347.4954241 hartree
pointgroup: C01 [X(C7H10O1)]
dipole: 1.1766709 -0.9898616 0.1082959 debye
dipolederiv: -0.8265467 0.2512001 -0.0341242 0.2596886 -0.7663338 0.0184319 -0.0428061 0.0027198 -0.3310077 0.0952238 0.0413159 0.0272329 0.0490018 0.0161292 0.0045848 0.0106412 -0.0221015 0.1393427 -0.2730852 -0.1031555 -0.0501449 -0.1288718 -0.0423752 -0.0372984 -0.079902 -0.0504593 0.1023395 -0.0907066 -0.0165342 -0.0049185 -0.029567 0.0029808 0.0188179 -0.1160352 0.0792922 0.1806412 0.1313896 0.1351101 0.0100858 0.2876562 -0.5796991 0.0080105 -0.0139947 -0.0022341 -0.0639984 0.864245 -0.0409054 0.1100779 -0.3086685 1.1591887 -0.0045267 0.1215488 0.048791 0.1282836 0.224366 -0.2232118 0.0235385 0.0672122 0.1931374 0.0041236 0.0902484 -0.0428023 -0.1876005 -0.179056 -0.0551656 -0.0174638 -0.023543 0.0479559 -0.0016589 -0.0274369 0.0055662 0.0649325 -0.1928756 -0.0958671 -0.0129973 -0.0917789 0.0304268 -0.0045781 -0.043926 -0.0164637 0.0823248 0.0864447 0.026876 -0.0471057 0.0167659 0.0387097 -0.0124729 0.0205158 0.0127335 -0.165921 0.0523389 0.015592 0.0055434 -0.0142877 -0.1130629 0.0516605 0.0251433 0.0811092 0.0805131 0.0364512 -0.0163291 -0.0199328 0.0167789 0.095896 0.0106528 -0.002319 -0.0417017 -0.1180758 -0.0105847 0.0182945 -0.0584789 -0.0753282 0.0895506 0.0066365 -0.080422 0.0431714 -0.1211275 -0.0401468 0.0865285 0.0565779 0.0635202 -0.0408524 -0.0697371 0.120788 -0.094057 0.0412602 0.0329382 -0.0688103 0.0066746 -0.0633818 -0.1424574 0.0103153 0.005999 -0.0069362 0.130981 -0.0006534 0.0020932 0.0716247 0.0263703 0.0816593 -0.0751326 0.1101703 -0.0393667 -0.0221465 0.0665942 0.0422289 -0.0030932 -0.0649863 -0.1579028 -0.0036571 0.0000414 0.0040976 0.1035545 0.0236636 0.0007398 -0.0630963 0.0134192 0.0870492 0.0758279 -0.0982545 0.0386417 -0.0442959 unknown
polarizability: 91.755784|-8.965549|82.1581332|2.1199935|-0.3711666|51.2571123 unknown
InChI: InChI=1S/C7H10O/c1-6-4-2-3-5-7(6)8/h4H,2-3,5H2,1H3
charge 0 multiplicity 1
18 atoms
O  -1.557626 1.605901 -0.029553
C  1.933631 0.467689 -0.394304
C  0.861188 1.375983 0.244419
C  1.801835 -0.979485 0.129647
C  -0.729315 -0.655779 0.003059
C  -0.556549 0.829795 0.046925
C  0.370072 -1.472741 0.074633
C  -2.14836 -1.175147 -0.090265
H  2.944918 0.863265 -0.184449
H  1.804227 0.467471 -1.494117
H  0.893552 2.405132 -0.154382
H  1.037587 1.450395 1.339072
H  2.164347 -1.038063 1.179994
H  2.452012 -1.664649 -0.448534
H  0.216699 -2.562183 0.096243
H  -2.759647 -0.798758 0.750091
H  -2.175792 -2.278405 -0.089921
H  -2.637377 -0.805119 -1.00976
