program: Gaussian 09
title: 000136875
version: EM64L-G09RevD.01
frameworkgroup: C1[X(C4H4O)]
method: RPBEPBE
basis: SDD
operation: Freq
keyword: #p
keyword: freq=noraman
keyword: PBEPBE/SDD
title: #p freq=noraman PBEPBE/SDD
converged: NO YES NO NO
title: Mulliken charges:
elementType: O C C C C H H H H
charge: -0.182855 -0.731847 0.133403 -0.069076 -0.119661 0.262641 0.260377 0.257949 0.189068
chargesum: 0.00000
title: Mulliken charges with hydrogens summed into heavy atoms:
elementType: O C C C C
charge: -0.182855 0.049121 0.133403 -0.069076 0.069407
polarizability: 8.21087442e+01 2.97417954e-01 3.16845143e+01 -2.64328172e-01 1.32316196e-02 2.36724032e+01
1716.lowfreq: -11.1145 -8.1409 -0.0011 -0.0009 -0.0007 18.7301 42.5637 123.7433 171.9677
frequency: 38.8980 123.7356 171.9549 320.3330 391.7295 552.5650 790.5914 962.0749 1024.4732 1033.0597 1170.1676 1373.9152 1399.4618 1452.0734 1456.3091 1568.7180 2249.7976 2907.4555 2979.0955 3066.9691 3076.8508
redmass: 1.2184 4.9231 2.9966 4.3132 4.2748 7.2059 5.3179 1.7497 1.4273 1.3934 5.5069 1.2162 1.2187 1.0392 1.0439 8.0674 11.7376 1.0836 1.0351 1.0971 1.0994
irintensity: 3.3365 5.1179 13.4918 6.1527 0.0715 2.4714 55.3533 0.4680 9.7147 5.5623 43.9717 5.3835 6.5159 16.6800 17.3913 209.4618 186.8786 104.9378 8.8168 7.6985 8.0049
temp: 298.150 k
press: 1.00000 atm
elementType: 8 6 6 6 6 1 1 1 1
symmnumber: 1
zpe: 168136.5 jmol-1
zpe.correction: 0.064040 hartree
zpe.thermalcorrener: 0.070168 hartree
zpe.thermalcorrenthalpy: 0.071112 hartree
zpe.thermalcorrgfe: 0.034111 hartree
zpe.sumelectzpe: -229.602677 hartree
zpe.sumelectthermal: -229.596549 hartree
zpe.sumelectthermalent: -229.595605 hartree
zpe.sumelectthermalfe: -229.632606 hartree
dipole: -4.2303 1.6585 0.0309
dipole: 4.5439
quadrupole: -28.2110 -28.9347 -28.8283
quadrupole: 4.9231 -0.0805 -0.0040
quadrupole: 0.4470 -0.2767 -0.1703 4.9231 -0.0805 -0.0040
hfenergy: -229.6667171 hartree
pointgroup: C01[X(C4H4O1)]
dipole: -1.6753872 0.6236257 0.0088457 debye
dipolederiv: -0.935508 0.0894262 0.001566 0.3477017 -0.5301344 -0.002004 -0.0010247 -0.0037735 -0.3289999 -0.1584256 -0.0295859 0.021288 -0.0504119 0.087738 0.0003206 0.1061093 0.0014162 0.0378177 0.6563685 0.0834231 -0.0199355 0.1297942 -0.0726174 -0.0013142 -0.0166595 0.0026252 -0.0314442 -1.2674164 -0.1006675 0.0137852 -0.3126058 -0.2497697 0.0033869 -0.0041592 -0.0018968 -0.1252076 1.6687666 0.0180488 -0.0056395 -0.0062503 0.863603 -0.0017112 0.0029665 0.0020186 0.185751 0.0240287 -0.0327915 -0.0177823 -0.0452668 -0.0145966 -0.0862671 -0.055567 -0.0877548 0.093839 0.0239568 -0.0128142 0.0480282 -0.0154758 0.1453238 0.0102013 0.0461614 0.0115348 -0.0445174 -0.0035321 0.0440354 -0.0388702 0.0584808 0.0048766 0.0763156 -0.0774628 0.072693 0.0971365 -0.0082385 -0.0590744 -0.00244 -0.105966 -0.2344235 0.0010721 -0.0003639 0.0031373 0.1156249 unknown
polarizability: 82.0839772|1.1695209|31.7099246|-0.1838244|-0.0020079|23.6717599 unknown
InChI: InChI=1S/C4H4O/c1-2-3-4-5/h4H,1H3
charge 0 multiplicity 1
9 atoms
O  2.360216 -0.481771 0.003305
C  -2.621174 -0.189704 -0.005858
C  -1.170893 0.022297 -0.003622
C  0.05618 0.197472 -0.001396
C  1.483117 0.42659 0.001252
H  -2.885047 -1.127165 -0.528013
H  -2.999664 -0.265739 1.030968
H  -3.148472 0.647477 -0.497892
H  1.773137 1.504744 0.000457
