program: Gaussian 09
title: 000136874
version: EM64L-G09RevD.01
frameworkgroup: C1[X(C5H11NO)]
method: RPBEPBE
basis: SDD
operation: Freq
keyword: #p
keyword: freq=noraman
keyword: PBEPBE/SDD
title: #p freq=noraman PBEPBE/SDD
converged: YES YES NO NO
title: Mulliken charges:
elementType: O N C C C C C H H H H H H H H H H H
charge: -0.280596 -0.376504 -0.017709 -0.665331 -0.711333 0.253737 -0.773190 0.247523 0.209051 0.196166 0.255304 0.231794 0.225623 0.201151 0.293718 0.252979 0.251321 0.206296
chargesum: 0.00000
title: Mulliken charges with hydrogens summed into heavy atoms:
elementType: O N C C C C C
charge: -0.280596 -0.082786 0.229815 -0.004810 -0.052765 0.253737 -0.062594
polarizability: 7.87067558e+01 1.19101265e+00 6.22873035e+01 -5.35491287e-01 -4.25954555e+00 5.36099769e+01
1716.lowfreq: -8.5507 -0.0011 -0.0007 -0.0007 5.6683 13.6972 43.0437 85.6190 123.2735
frequency: 41.6103 85.5741 123.2700 177.8829 212.1255 250.8727 303.2180 390.7155 413.8219 464.5642 520.0789 587.7231 609.4873 837.6181 890.8155 921.7630 948.1837 964.6463 1013.3831 1040.8649 1143.1372 1155.3547 1182.2907 1249.8869 1314.9066 1353.9176 1376.0394 1384.8790 1394.3823 1449.7191 1456.7132 1465.5884 1468.8043 1472.6800 1486.6381 1487.4786 1614.1743 2973.7188 2980.3560 2993.9030 3022.5096 3067.1061 3079.1004 3091.3210 3095.5853 3097.4202 3097.8507 3546.5109
redmass: 3.4065 1.2642 2.0785 2.8218 1.0257 1.1785 2.4021 2.7434 2.6206 2.2623 1.3476 4.0135 2.6314 2.3872 2.8366 1.2297 1.4780 2.1613 1.6381 1.6485 2.1286 2.0946 2.2198 1.7800 1.6334 1.2515 1.2140 1.2374 1.2299 1.0468 1.2416 1.0952 1.0536 1.1980 1.2620 1.0855 6.5401 1.0380 1.0362 1.0360 1.0847 1.0979 1.0989 1.0995 1.1001 1.1000 1.0983 1.0778
irintensity: 7.1227 3.6569 1.5961 7.1390 0.0667 1.0609 0.9786 1.6303 4.9991 1.9400 101.8896 4.1989 1.6024 1.1202 0.4151 2.7301 0.2323 10.5037 0.4338 14.1403 16.7337 3.2368 37.8999 55.8497 15.4215 2.5437 25.7344 68.9366 20.5997 15.0144 143.8043 32.6198 5.1061 37.2780 41.0365 40.0328 187.0593 25.8711 28.1429 13.4427 1.2431 14.6346 63.4401 30.6667 21.2627 28.5761 11.6714 12.5350
temp: 298.150 k
press: 1.00000 atm
elementType: 8 7 6 6 6 6 6 1 1 1 1 1 1 1 1 1 1 1
symmnumber: 1
zpe: 408525.9 jmol-1
zpe.correction: 0.155599 hartree
zpe.thermalcorrener: 0.164661 hartree
zpe.thermalcorrenthalpy: 0.165605 hartree
zpe.thermalcorrgfe: 0.121622 hartree
zpe.sumelectzpe: -326.544619 hartree
zpe.sumelectthermal: -326.535557 hartree
zpe.sumelectthermalent: -326.534613 hartree
zpe.sumelectthermalfe: -326.578596 hartree
dipole: -1.5314 -3.1655 2.0138
dipole: 4.0523
quadrupole: -41.5956 -45.5083 -44.8049
quadrupole: -4.3846 3.5280 1.0602
quadrupole: 2.3740 -1.5387 -0.8353 -4.3846 3.5280 1.0602
hfenergy: -326.700218 hartree
pointgroup: C01 [X(C5H11N1O1)]
dipole: 0.6584823 1.3070928 0.6322287 debye
dipolederiv: -0.7068675 -0.0179161 0.0028824 -0.270988 -0.856744 -0.2424224 -0.1335377 -0.248648 -0.5052032 -1.2348431 -0.185367 -0.0857146 -0.2305685 -0.5194505 0.0891707 -0.0164778 0.1196728 -0.4282437 0.5911315 -0.0881614 -0.0145562 -0.2099194 0.2905365 -0.0850168 -0.1554362 -0.1265633 0.283143 -0.0704805 -0.016295 0.000031 0.0398107 -0.052634 0.1067427 0.0199063 0.1481247 -0.0024561 -0.0780359 -0.0220597 0.0306436 -0.0252114 -0.0157012 0.0671916 0.051688 0.0692424 0.0855678 1.5158534 0.1977259 0.0296284 0.4302381 0.9729649 0.4003109 0.1313041 0.3909965 0.3791813 -0.3349996 0.1760527 0.1174613 0.1538768 -0.0400404 -0.0463907 0.1090887 -0.0544979 -0.0185652 0.0339472 -0.0273161 -0.0625182 0.0356711 0.0195627 -0.0578055 0.0022902 -0.0274972 -0.0619381 -0.1221205 0.1195918 0.0536051 0.1354019 0.0476541 -0.0194452 0.0637327 -0.0456722 0.0464458 0.0825117 0.0015446 -0.0530091 -0.0378771 0.0044665 -0.1299503 -0.0654973 -0.0608973 -0.1054528 0.0163403 -0.12676 0.0428188 -0.0975344 -0.0100491 0.050722 0.0284631 0.0311885 0.0706199 0.0787183 0.0531815 -0.0693539 0.0167853 -0.0436351 0.1264725 -0.048907 0.1236701 -0.0309153 -0.1211897 0.0535612 0.0679162 0.0978584 0.0452357 -0.0483734 0.0654891 -0.030057 0.082687 0.075343 -0.0229379 -0.0025099 -0.0546374 0.0085974 -0.0770244 -0.056374 -0.1377203 -0.1097691 0.1443896 -0.0122068 -0.0076727 0.0338704 0.1372435 -0.1033535 0.0183841 -0.1245776 0.2459533 0.0256439 0.0326633 -0.0797478 0.0460774 0.0943591 -0.0065403 -0.116908 0.0280152 -0.0095937 0.0645478 -0.0326694 0.0629897 -0.0528696 0.0258566 0.084997 0.1005108 0.0494788 0.0174111 0.0401102 -0.0826316 -0.032894 -0.0099842 -0.1082229 -0.1092851 0.0022809 -0.1042584 0.061128 unknown
polarizability: 78.7243649|1.1385888|63.0024082|-0.8637013|3.2611683|52.8772631 unknown
InChI: InChI=1S/C5H11NO/c1-4(2)6-5(3)7/h4,6H,1-3H3
charge 0 multiplicity 1
18 atoms
O  -1.387681 -1.163079 -0.547651
N  -0.023787 0.560241 0.208643
C  1.23782 -0.082318 -0.230656
C  1.731429 -1.109105 0.815962
C  2.290312 1.003666 -0.528728
C  -1.260504 -0.036037 0.025065
C  -2.461611 0.750705 0.547774
H  0.990408 -0.631531 -1.158178
H  2.634271 -1.630815 0.448501
H  1.983346 -0.611422 1.771318
H  0.948244 -1.863081 1.003124
H  1.932894 1.706845 -1.302266
H  3.224371 0.539007 -0.889877
H  2.538617 1.580671 0.384073
H  0.036262 1.453548 0.700677
H  -3.161723 0.93179 -0.28594
H  -2.996434 0.138157 1.294222
H  -2.194134 1.719158 1.00584
