program: Gaussian 09
title: 000136867
version: EM64L-G09RevD.01
frameworkgroup: C1[X(C3H6O2S)]
method: RPBEPBE
basis: SDD
operation: Freq
keyword: #pfreq=noraman
keyword: PBEPBE/SDD
title: #p freq=noraman PBEPBE/SDD
converged: NO NO NO NO
title: Mulliken charges:
elementType: S O O C C C H H H H H H
charge: 0.030601 -0.190022 -0.230156 -0.082841 -0.496778 -0.489705 0.241520 0.241518 0.239931 0.252035 0.252036 0.231860
chargesum: 0.00000
title: Mulliken charges with hydrogens summed into heavy atoms:
elementType: S O O C C C
charge: 0.030601 -0.190022 -0.230156 -0.082841 0.226191 0.246227
polarizability: 7.50062525e+01 8.20653449e+00 6.04059627e+01 -9.16564471e-04 -6.27083215e-04 3.30190061e+01
1716.lowfreq: -15.5659 -7.6962 0.0008 0.0014 0.0046 6.3039 114.2123 137.9273 157.0534
frequency: 114.1826 137.8663 157.0501 197.3000 221.6505 269.4536 434.0090 533.7021 584.5205 660.2017 900.3841 985.4333 1099.0217 1121.1273 1122.5566 1139.7154 1157.9199 1239.4659 1430.5543 1435.1940 1443.6186 1453.3946 1461.2716 1464.5121 3001.9826 3005.5668 3105.2482 3112.0630 3148.0578 3151.0055
redmass: 2.8958 1.2543 1.1125 2.6008 3.1608 4.8154 5.5831 5.7204 11.9218 6.9071 9.7188 6.8642 1.2449 1.2555 2.5061 1.5735 2.0065 6.3600 1.1808 1.1692 1.0485 1.0525 1.0488 1.0538 1.0291 1.0287 1.1045 1.1052 1.1049 1.1055
irintensity: 9.3052 1.5443 1.4127 0.4628 8.4032 1.3825 8.7912 11.6332 2.9147 4.7652 19.2797 5.4217 0.0127 0.0673 180.3283 95.2645 121.9105 450.1657 20.0177 25.9966 18.5758 14.4676 27.7640 20.8480 29.0064 33.8693 17.7630 29.6206 15.4533 16.7995
temp: 298.150 k
press: 1.00000 atm
elementType: 16 8 8 6 6 6 1 1 1 1 1 1
symmnumber: 1
zpe: 234994.6 jmol-1
zpe.correction: 0.089505 hartree
zpe.thermalcorrener: 0.096925 hartree
zpe.thermalcorrenthalpy: 0.097870 hartree
zpe.thermalcorrgfe: 0.057617 hartree
zpe.sumelectzpe: -665.906896 hartree
zpe.sumelectthermal: -665.899475 hartree
zpe.sumelectthermalent: -665.898531 hartree
zpe.sumelectthermalfe: -665.938783 hartree
dipole: 1.8627 4.0693 0.0001
dipole: 4.4754
quadrupole: -36.9933 -44.3525 -43.0167
quadrupole: -3.4668 -0.0001 0.0001
quadrupole: 4.4608 -2.8983 -1.5625 -3.4668 -0.0001 0.0001
hfenergy: -665.9964003 hartree
pointgroup: C01 [X(C3H6O2S1)]
dipole: -0.0750078 1.7591538 -0.00004 debye
dipolederiv: -0.5051985 0.2840847 -0.0000041 0.1918936 -0.6607746 0.000006 0.000027 -0.0000477 -0.2072022 -1.564916 0.5383255 0.0000042 0.1447952 -0.4999691 0.0000148 -0.0001256 0.0000649 -0.2603979 -0.8270036 -0.3340144 0.0000057 -0.5042242 -1.3120796 -0.0000186 0.0000269 0.0000672 -0.2162719 1.792039 -0.5402137 0.0000128 0.159177 1.6435275 0.0000035 0.0000682 -0.0000679 0.054118 0.5260559 -0.170822 -0.0000038 -0.2759394 0.4073883 -0.0000045 0.0000106 -0.0000101 0.3110742 0.5278683 0.3239538 -0.0000088 0.1144443 0.3554897 0.0000021 -0.0000028 -0.0000042 0.2614831 0.051097 0.0005748 0.0678779 0.0927822 -0.0179239 0.0764138 0.0192937 0.0991769 -0.0555325 0.0511119 0.0005943 -0.0678601 0.0927991 -0.0179171 -0.076406 -0.0192689 -0.0991816 -0.0555606 -0.126519 -0.0041705 -0.0000172 -0.0517732 0.0589077 -0.0000079 -0.0000215 -0.0000018 0.123475 -0.0045719 -0.0544301 0.0298422 0.0568232 0.0863618 -0.092409 0.0604975 -0.0414105 -0.0437819 -0.0045765 -0.0544222 -0.0298492 0.0568284 0.0863757 0.0923971 -0.060509 0.0414065 -0.0437843 0.0846133 0.0105396 0.0000004 -0.0776062 -0.1293865 0.0000087 0.0000039 0.0000083 0.1323811 unknown
polarizability: 67.1977256|-10.9718217|68.2144896|-0.0006124|0.0009264|33.0190061 unknown
InChI: InChI=1S/C3H6O2S/c1-4-3(6)5-2/h1-2H3
charge 0 multiplicity 1
12 atoms
S  0.978101 -1.83419 -0.00002
O  -1.328337 -0.463278 -0.000016
O  0.507802 0.877865 0.000025
C  0.042311 -0.429259 0.000095
C  -2.097169 0.810967 -0.000046
C  1.97264 1.077494 -0.000035
H  -1.862759 1.401619 -0.901203
H  -1.86291 1.401568 0.901187
H  -3.146209 0.483864 -0.00014
H  2.4156 0.613914 -0.897883
H  2.415663 0.613968 0.89781
H  2.100767 2.169267 -0.000074
