program: Gaussian 09
title: 000136857
version: EM64L-G09RevD.01
frameworkgroup: C1[X(C2H6SSi)]
method: RPBEPBE
basis: SDD
operation: Freq
keyword: #p
keyword: freq=noraman
keyword: PBEPBE/SDD
title: #p freq=noraman PBEPBE/SDD
converged: YES YES NO NO
title: Mulliken charges:
elementType: S Si C C H H H H H H
charge: -0.379088 0.795911 -1.002773 -1.002780 0.259412 0.276136 0.258815 0.259408 0.258822 0.276138
chargesum: 0.00000
title: Mulliken charges with hydrogens summed into heavy atoms:
elementType: S Si C C
charge: -0.379088 0.795911 -0.208410 -0.208413
polarizability: 8.95963685e+01 -1.26720486e-04 5.69187700e+01 2.93520752e-03 -1.08894381e-04 3.95691646e+01
1716.lowfreq: -61.1560 -13.4648 0.0031 0.0031 0.0040 8.3584 14.2805 47.2441 194.0265
frequency: -61.1071 47.1531 194.0248 197.3889 201.4632 507.7549 704.5449 715.5538 754.7247 829.6521 835.1882 931.7095 1298.1679 1306.4608 1429.0082 1433.6913 1439.2525 1447.9964 2981.0221 2983.4413 3074.2994 3076.6742 3120.8489 3120.8681
redmass: 1.0207 1.0609 3.8320 4.5219 2.5954 6.3488 3.0063 5.2756 1.1652 1.5556 1.3034 1.5008 1.1895 1.1738 1.0493 1.0592 1.0455 1.0492 1.0352 1.0352 1.0971 1.0973 1.0981 1.0979
irintensity: 0.0002 0.0958 0.8759 7.0782 0.2934 1.1487 17.4243 29.2245 0.0014 64.1154 20.3690 110.6556 46.0978 24.3726 7.7124 0.0011 12.8203 34.7271 3.1049 5.6743 0.0001 13.0502 3.0782 3.9261
temp: 298.150 k
press: 1.00000 atm
elementType: 16 14 6 6 1 1 1 1 1 1
symmnumber: 1
zpe: 195176.1 jmol-1
zpe.correction: 0.074339 hartree
zpe.thermalcorrener: 0.080468 hartree
zpe.thermalcorrenthalpy: 0.081413 hartree
zpe.thermalcorrgfe: 0.043664 hartree
zpe.sumelectzpe: -766.949177 hartree
zpe.sumelectthermal: -766.943047 hartree
zpe.sumelectthermalent: -766.942103 hartree
zpe.sumelectthermalfe: -766.979851 hartree
dipole: -4.5262 0.0001 0.0026
dipole: 4.5262
quadrupole: -44.1581 -39.4556 -39.1357
quadrupole: 0.0001 -0.0065 -0.0001
quadrupole: -3.2417 1.4609 1.7808 0.0001 -0.0065 -0.0001
hfenergy: -767.0235153 hartree
pointgroup: C01 [X(C2H6S1Si1)]
dipole: 1.7103896 0.0029064 0.4955399 debye
dipolederiv: -0.5992727 -0.0001559 -0.0689068 -0.0001501 -0.5083878 -0.0001196 -0.0690323 -0.0001203 -0.3814812 1.2124101 0.0000849 0.2551422 0.0000912 1.1586097 0.0004551 0.2542715 0.0004523 0.4048642 -0.4442661 0.1205219 -0.1016148 0.0717778 -0.4792728 0.0204352 -0.0999564 0.0345808 -0.1180511 -0.4435938 -0.120387 -0.101571 -0.071654 -0.479945 -0.0208007 -0.0998869 -0.0349391 -0.1180749 -0.0245462 0.0253059 0.0906579 0.0378102 0.1053785 0.0295281 0.0957455 -0.0036862 0.0457193 0.0852235 -0.0594564 -0.0091882 -0.0903636 -0.0558246 -0.024807 -0.0100242 -0.0158074 0.1176429 0.0767266 0.0190116 -0.0729996 0.0477941 0.1049059 -0.0061503 -0.0784305 0.0154513 -0.056999 -0.0243819 -0.0257459 0.0907521 -0.0382568 0.1051629 -0.029227 0.0957304 0.0040072 0.0457596 0.0769894 -0.0191126 -0.072982 -0.0478878 0.1046829 0.0058893 -0.0783376 -0.0157317 -0.057019 0.0847111 0.0599337 -0.0092899 0.0908391 -0.0553097 0.0247969 -0.0100796 0.0157931 0.1176392 unknown
polarizability: 85.7050344|0.0483323|56.9188512|13.398736|0.0231883|43.4604175 unknown
InChI: InChI=1S/C2H6SSi/c1-4(2)3/h1-2H3
charge 0 multiplicity 1
10 atoms
S  -2.075055 -0.003533 -0.625116
Si -0.101386 -0.000192 -0.050621
C  0.918377 -1.57868 0.243182
C  0.912956 1.581761 0.243253
H  1.787345 -1.617053 -0.440936
H  0.296504 -2.472155 0.073843
H  1.307295 -1.608008 1.278707
H  1.781923 1.623063 -0.440694
H  1.301562 1.612495 1.278854
H  0.28808 2.473101 0.073729
