program: Gaussian 09
title: 000136827
version: EM64L-G09RevD.01
frameworkgroup: C1[X(C9H20)]
method: RPBEPBE
basis: SDD
operation: Freq
keyword: #p
keyword: freq=noraman
keyword: PBEPBE/SDD
title: #p freq=noraman PBEPBE/SDD
converged: YES YES NO NO
title: Mulliken charges:
elementType: C C C C C C C C C H H H H H H H H H H H H H H H H H H H H
charge: 0.405651 -0.385137 -0.385137 -0.776337 -0.777762 -0.403065 -0.403064 -0.695783 -0.695783 0.186842 0.186233 0.186842 0.186234 0.214552 0.208221 0.214553 0.215184 0.208162 0.215185 0.207388 0.206962 0.207390 0.206959 0.214892 0.208995 0.208967 0.214892 0.208995 0.208967
chargesum: 0.00000
title: Mulliken charges with hydrogens summed into heavy atoms:
elementType: C C C C C C C C C
charge: 0.405651 -0.012061 -0.012062 -0.139010 -0.139230 0.011285 0.011285 -0.062929 -0.062929
polarizability: 1.16379529e+02 -1.43713963e-05 9.01889175e+01 -5.29448691e-06 -1.66940892e-02 8.79950185e+01
1716.lowfreq: -24.3565 -9.0035 -0.0004 0.0005 0.0006 2.7977 10.0797 58.8556 89.1295
frequency: 8.5271 58.7816 89.1052 98.9212 116.5059 222.5207 230.0836 241.5082 244.1442 248.4910 296.4010 323.9327 324.4637 333.2474 401.6529 424.7949 564.7940 733.8275 740.1512 742.2508 851.5683 852.7025 857.5820 922.4287 929.4446 934.3604 975.2971 992.6235 1014.4804 1054.3338 1056.5089 1080.1954 1101.0991 1118.9678 1195.9401 1205.7695 1222.8916 1237.2812 1268.9179 1291.0896 1291.9145 1295.7266 1332.9273 1346.7803 1359.0077 1379.2528 1388.7596 1389.1143 1396.4132 1449.5126 1461.2186 1461.3402 1471.9021 1474.3709 1477.0032 1478.3878 1482.2358 1484.5708 1485.1992 1487.4851 1496.3972 2937.7251 2943.9588 2969.6144 2969.6678 2970.1055 2974.5177 2981.0884 2983.0049 2987.2133 2994.3444 3031.6870 3034.6192 3062.6568 3065.9279 3066.9849 3068.7958 3069.5043 3069.5940 3071.2401 3073.4038
redmass: 1.4971 1.8001 2.4626 1.8118 3.0378 1.1445 1.8864 1.1071 1.2703 1.1571 3.0758 2.1388 2.5286 2.7985 2.0147 2.4684 2.5091 1.1044 3.0236 1.1669 2.1781 1.2142 1.3457 1.6273 1.4423 2.0115 2.1964 1.2136 1.3954 2.6495 2.4297 1.8902 1.4157 2.3228 2.0202 2.0635 3.1258 1.2974 1.3209 1.1470 1.3552 1.3863 1.3070 1.5396 1.4636 1.2013 1.2088 1.2120 1.2128 1.0759 1.0472 1.0744 1.0635 1.0582 1.0478 1.0418 1.0517 1.0656 1.0749 1.0674 1.0571 1.0590 1.0583 1.0357 1.0353 1.0354 1.0380 1.0591 1.0579 1.1000 1.0993 1.1016 1.1011 1.0989 1.1001 1.0982 1.0993 1.0990 1.1008 1.0998 1.0977
irintensity: 0.0000 0.0436 0.0047 0.0000 0.0512 0.0007 0.0584 0.0207 0.0036 0.0001 0.0287 0.0059 0.0750 0.4372 0.0047 0.3027 2.4092 0.0000 0.7298 14.3086 0.3991 0.0019 0.6833 1.9477 0.6378 20.9366 0.5144 0.0000 0.0003 1.8682 0.7041 7.5833 0.0001 0.0360 14.2324 3.4430 8.3639 0.0001 0.5423 2.5909 8.9848 0.1856 0.3520 1.0391 0.1167 26.8377 4.4500 6.6834 24.9077 1.9765 0.0021 0.0003 0.7297 0.6376 20.9096 0.0000 4.7789 15.7994 3.9434 3.2911 37.3512 0.1488 61.7730 44.2409 55.0347 47.6266 0.4272 0.9194 69.4245 0.0011 27.6887 0.0005 36.2711 18.5047 0.0232 18.6134 41.6219 106.6113 166.1208 0.6599 111.4915
temp: 298.150 k
press: 1.00000 atm
elementType: 6 6 6 6 6 6 6 6 6 1 1 1 1 1 1 1 1 1 1 1 1 1 1 1 1 1 1 1 1
symmnumber: 1
zpe: 704736.6 jmol-1
zpe.correction: 0.268420 hartree
zpe.thermalcorrener: 0.281188 hartree
zpe.thermalcorrenthalpy: 0.282132 hartree
zpe.thermalcorrgfe: 0.228396 hartree
zpe.sumelectzpe: -354.176461 hartree
zpe.sumelectthermal: -354.163692 hartree
zpe.sumelectthermalent: -354.162748 hartree
zpe.sumelectthermalfe: -354.216485 hartree
dipole: 0.0000 0.0006 -0.0021
dipole: 0.0022
quadrupole: -61.6657 -61.3797 -60.4590
quadrupole: 0.0000 0.0000 0.0013
quadrupole: -0.4975 -0.2116 0.7091 0.0000 0.0000 0.0013
hfenergy: -354.4448805 hartree
pointgroup: C01 [X(C9H20)]
dipole: 0. -0.0003003 0.0008231 debye
polarizability: 116.3795291|0.0002276|90.1795583|-0.0000283|0.1439587|88.0043776 unknown
InChI: InChI=1S/C9H20/c1-5-7-9(3,4)8-6-2/h5-8H2,1-4H3
charge 0 multiplicity 1
29 atoms
C  0.000016 -0.358461 -0.034894
C  1.254462 0.575413 0.041331
C  -1.254443 0.575394 0.041307
C  0.000035 -1.147243 -1.371433
C  0.000014 -1.353292 1.157458
C  2.645627 -0.098016 -0.00812
C  -2.645599 -0.098061 -0.00811
C  3.790937 0.936901 0.062314
C  -3.790924 0.93684 0.06232
H  1.187445 1.169936 0.97804
H  1.191118 1.307711 -0.792504
H  -1.187433 1.169949 0.977996
H  -1.191119 1.307666 -0.792552
H  -0.889523 -1.79786 -1.453742
H  0.00006 -0.458819 -2.238493
H  0.889579 -1.797882 -1.453706
H  0.889261 -2.009219 1.134602
H  -0.000013 -0.812911 2.123986
H  -0.889204 -2.009256 1.134574
H  2.752055 -0.811933 0.831762
H  2.749628 -0.687993 -0.939671
H  -2.752001 -0.811962 0.831787
H  -2.749604 -0.688058 -0.939649
H  4.781889 0.447479 0.028658
H  3.735614 1.647784 -0.784047
H  3.73617 1.526362 0.997331
H  -4.78187 0.447404 0.028674
H  -3.735616 1.647714 -0.78405
H  -3.736161 1.526312 0.99733
