program: Gaussian 09
title: 000136815
version: EM64L-G09RevD.01
frameworkgroup: C1[X(C16H24Si2)]
method: RPBEPBE
basis: SDD
operation: Freq
keyword: #p
keyword: freq=noraman
keyword: PBEPBE/SDD
title: #p freq=noraman PBEPBE/SDD
converged: YES YES NO NO
title: Mulliken charges:
elementType: Si Si C C C C C C C C C C C C C C C C H H H H H H H H H H H H H H H H H H H H H H H H
charge: 1.242731 1.242722 -0.326949 -0.326945 0.316476 0.316467 -0.336981 -0.336982 -1.036470 -1.003109 -1.003234 -1.036469 -1.003104 -1.003225 -0.421427 -0.421413 -0.278656 -0.278658 0.242029 0.242029 0.241316 0.237889 0.237956 0.239420 0.241231 0.231142 0.241236 0.239639 0.231137 0.237891 0.237956 0.241316 0.231143 0.239415 0.241231 0.239630 0.231137 0.241238 0.237233 0.237229 0.227391 0.227392
chargesum: 0.00000
title: Mulliken charges with hydrogens summed into heavy atoms:
elementType: Si Si C C C C C C C C C C C C C C C C
charge: 1.242731 1.242722 -0.326949 -0.326945 0.316476 0.316467 -0.094952 -0.094954 -0.319308 -0.291316 -0.291222 -0.319307 -0.291314 -0.291219 -0.184194 -0.184184 -0.051265 -0.051267
polarizability: 2.83627885e+02 -9.39395142e-05 2.50924218e+02 6.44067191e-02 -1.57760305e-04 1.50545212e+02
1716.lowfreq: -8.2739 -0.0020 -0.0012 -0.0009 7.5233 15.8036 41.1793 46.3209 68.5939
frequency: 41.1767 46.3196 68.5613 79.3169 89.0397 89.0775 90.1964 95.8745 107.2412 138.2004 152.8296 160.5627 178.3321 182.2197 185.0731 186.2559 194.2688 199.6431 207.1589 214.7166 226.7947 243.4139 258.0237 311.0314 340.1517 394.9648 431.4342 457.1616 470.8882 524.2578 544.1835 591.7994 599.8237 621.1816 646.1058 667.6471 687.7167 688.3532 688.8488 689.0775 741.8982 742.1829 764.8513 788.7947 802.1384 806.4275 809.4021 811.3862 818.0205 857.7484 862.8676 889.2682 900.8192 901.4923 902.1553 902.6529 907.8289 932.5864 962.0847 965.3585 985.7333 989.2041 1037.7621 1111.0685 1148.5369 1177.2645 1206.2865 1228.0121 1271.7846 1291.9835 1292.5110 1295.7319 1295.7730 1306.7709 1306.8181 1322.5269 1366.2627 1384.5941 1431.5825 1440.3103 1440.3284 1442.3811 1447.0354 1448.0143 1448.6970 1448.9811 1450.7226 1451.1611 1458.9461 1458.9854 1464.4633 1464.5737 1511.2338 1554.8004 1572.3780 1620.7585 2979.2937 2979.3353 2981.5657 2981.5778 2982.2709 2982.4175 3078.8665 3078.9947 3080.7366 3080.7846 3082.8489 3083.0116 3085.4490 3085.4954 3092.4871 3092.4935 3093.0201 3093.1661 3117.0521 3125.2669 3139.1297 3140.5195 3156.7282 3166.7741
redmass: 3.5380 2.9315 3.0673 2.3080 1.0728 1.1660 1.4160 1.0261 1.8160 3.2938 2.9257 3.0747 1.7578 3.0037 1.0924 1.4362 2.7902 2.7892 2.4715 2.7749 3.4535 2.9868 3.4626 4.0521 4.4757 5.2924 3.1603 4.5936 3.2944 6.9658 6.4787 3.4288 4.2879 4.4807 3.5291 5.6210 3.3198 3.2259 3.2409 3.1753 1.1981 1.1734 1.2824 5.0822 1.3858 2.4834 1.3831 1.3946 1.3488 1.2964 3.1512 1.8729 1.4720 1.4782 1.4958 1.4864 1.5322 1.8718 1.3704 1.3924 6.4012 1.3271 2.4806 3.0277 1.6890 1.0901 2.0887 1.6550 1.5825 1.2291 1.2096 1.1962 1.1964 1.2138 1.1930 3.1157 1.8159 5.9772 2.8252 1.0551 1.0551 1.7642 1.0549 1.1866 1.0541 1.0541 1.0865 1.0719 1.0492 1.0492 1.0481 1.0581 3.3939 4.8693 7.5105 6.0631 1.0343 1.0343 1.0345 1.0345 1.0344 1.0343 1.0980 1.0980 1.0984 1.0984 1.0975 1.0974 1.0987 1.0987 1.0980 1.0980 1.0977 1.0977 1.0861 1.0850 1.0944 1.0886 1.0931 1.0990
irintensity: 0.1202 0.0000 0.0908 0.0000 0.0490 0.0038 0.0061 0.0131 0.0037 0.1450 0.0088 0.0670 0.0000 0.1194 0.0811 0.0000 0.0007 1.1103 0.0000 4.2535 10.0322 2.2290 6.1603 2.4076 0.0000 24.0682 10.4538 4.2927 0.0000 1.3594 1.1532 0.2893 0.9715 38.8160 0.0000 1.1522 17.0092 0.7910 18.8215 0.0887 5.5576 0.0004 32.0853 0.4650 27.8275 0.0031 2.3044 0.0007 109.7086 7.1829 0.9077 0.0027 0.5826 106.5420 0.0457 143.5693 474.9302 31.9216 3.8311 0.0000 56.6176 0.0000 6.0767 1.5932 11.1537 0.0732 26.4426 0.0902 0.1492 82.2543 0.5130 0.0204 82.7767 0.1782 47.8409 17.5177 4.6753 1.6221 0.0196 0.0229 0.0003 0.4150 4.6053 0.0675 0.0021 1.4376 4.7282 18.3872 0.0125 19.4133 2.0122 25.1775 16.8470 1.4138 0.4215 0.3457 0.4753 26.4805 0.6383 33.0716 37.1914 0.7645 4.8792 0.2955 0.0031 7.6106 112.1450 0.0767 0.1007 38.5421 3.3685 4.4621 13.4803 55.0443 6.8033 0.7818 24.2415 13.2222 44.9339 21.7524
temp: 298.150 k
press: 1.00000 atm
elementType: 14 14 6 6 6 6 6 6 6 6 6 6 6 6 6 6 6 6 1 1 1 1 1 1 1 1 1 1 1 1 1 1 1 1 1 1 1 1 1 1 1 1
symmnumber: 1
zpe: 910311.2 jmol-1
zpe.correction: 0.346719 hartree
zpe.thermalcorrener: 0.369755 hartree
zpe.thermalcorrenthalpy: 0.370699 hartree
zpe.thermalcorrgfe: 0.295267 hartree
zpe.sumelectzpe: -1201.597082 hartree
zpe.sumelectthermal: -1201.574046 hartree
zpe.sumelectthermalent: -1201.573102 hartree
zpe.sumelectthermalfe: -1201.648534 hartree
dipole: 0.0000 -0.1617 0.0000
dipole: 0.1617
quadrupole: -115.1782 -117.9590 -130.7507
quadrupole: 0.0000 0.0103 0.0000
quadrupole: 6.1178 3.3370 -9.4547 0.0000 0.0103 0.0000
hfenergy: -1201.9438009 hartree
pointgroup: C01 [X(C16H24Si2)]
dipole: -0.0000011 0.063624 0.000015 debye
polarizability: 283.6232885|-0.0004516|250.9242152|-0.7847341|0.0154636|150.5498105 unknown
InChI: InChI=1S/C16H24Si2/c1-17(2,3)15-11-12-16(18(4,5)6)14-10-8-7-9-13(14)15/h7-12H,1-6H3
charge 0 multiplicity 1
42 atoms
Si 3.389363 0.745098 -0.017825
Si -3.389273 0.745247 0.018297
C  1.462406 0.620792 -0.008484
C  -1.462323 0.620863 0.008899
C  0.729282 -0.630686 -0.004479
C  -0.729265 -0.630647 0.004509
C  0.714605 1.808459 -0.003808
C  -0.714463 1.808494 0.004576
C  3.880308 2.596288 -0.022418
C  4.125414 -0.061273 -1.59606
C  4.136317 -0.058939 1.556419
C  -3.880143 2.596457 0.023514
C  -4.125351 -0.06161 1.596269
C  -4.136281 -0.05826 -1.556189
C  1.407608 -1.897494 -0.009049
C  -1.407671 -1.897412 0.008713
C  0.71358 -3.10841 -0.00495
C  -0.713719 -3.108369 0.004227
H  1.225005 2.778748 -0.00653
H  -1.224813 2.778809 0.007612
H  4.982751 2.684829 -0.032284
H  3.495128 3.121693 -0.915549
H  3.510973 3.122167 0.877086
H  3.87981 -1.134719 -1.678324
H  3.73703 0.442145 -2.500414
H  5.227288 0.038934 -1.596118
H  3.754322 0.446044 2.462618
H  3.889547 -1.131927 1.641556
H  5.238267 0.039699 1.549263
H  -3.494999 3.121514 0.916865
H  -3.510731 3.122656 -0.87577
H  -4.982582 2.685036 0.033341
H  -5.227211 0.038757 1.596422
H  -3.879906 -1.135125 1.678113
H  -3.736848 0.441409 2.500794
H  -3.889778 -1.131295 -1.641528
H  -5.238206 0.040661 -1.549107
H  -3.754079 0.446812 -2.462251
H  2.501625 -1.913509 -0.016201
H  -2.501691 -1.913354 0.015869
H  1.26091 -4.057579 -0.008734
H  -1.261106 -4.057505 0.007712
