program: Gaussian 09
title: 000136810
version: EM64L-G09RevD.01
frameworkgroup: C1[X(C14H22)]
method: RPBEPBE
basis: SDD
operation: Freq
keyword: #p
keyword: freq=noraman
keyword: PBEPBE/SDD
title: #p freq=noraman PBEPBE/SDD
converged: YES YES NO YES
title: Mulliken charges:
elementType: C C C C C C C C C C C C C C H H H H H H H H H H H H H H H H H H H H H H
charge: 0.116143 0.115706 0.523312 0.523488 -0.635950 -0.702679 -0.702690 -0.752492 -0.702489 -0.702493 -0.752403 -0.430184 -0.430082 -0.291534 0.266373 0.206170 0.216313 0.221814 0.216307 0.206170 0.221812 0.218396 0.216655 0.216665 0.206148 0.216300 0.221796 0.216297 0.206148 0.221797 0.218378 0.216650 0.216652 0.229566 0.229492 0.218445
chargesum: 0.00000
title: Mulliken charges with hydrogens summed into heavy atoms:
elementType: C C C C C C C C C C C C C C
charge: 0.116143 0.115706 0.523312 0.523488 -0.369577 -0.058382 -0.058400 -0.100777 -0.058244 -0.058251 -0.100723 -0.200617 -0.200590 -0.073088
polarizability: 1.87966444e+02 2.90912027e-03 1.50555717e+02 -5.29980943e-04 -1.86190657e-04 1.09448002e+02
1716.lowfreq: -9.2023 -0.0005 -0.0005 0.0002 7.6645 20.2089 42.4421 42.5876 129.3975
frequency: 42.3327 42.5062 129.3972 133.0810 134.3957 215.2588 215.4128 248.3697 249.2280 265.9235 268.3309 302.0748 305.4312 315.8463 316.2959 340.6444 341.8801 343.7409 379.0510 386.5694 438.7068 482.6194 488.6166 520.5906 529.8996 644.2904 670.6654 719.8374 746.5362 813.1542 822.9060 881.2011 913.3872 913.7018 921.0889 926.2264 932.1872 932.4464 943.9495 945.6607 982.6481 991.9537 1020.3966 1022.2688 1027.7876 1028.8339 1092.2542 1114.9684 1136.4718 1193.5636 1204.9045 1205.4540 1216.7701 1217.6570 1252.5143 1285.9044 1313.8968 1371.1424 1375.8644 1376.2057 1377.3161 1380.1258 1403.7085 1404.6410 1418.5514 1459.6927 1460.1589 1462.9728 1466.0163 1466.3904 1469.5754 1475.6237 1479.4006 1484.8668 1486.6838 1487.4827 1497.4254 1497.9573 1589.3568 1610.1134 2970.8230 2971.0794 2971.3973 2971.6364 2976.8444 2977.2922 3065.0189 3065.1455 3065.4897 3065.7049 3069.4187 3069.7181 3074.1105 3074.9620 3079.0843 3079.3660 3082.1006 3082.4244 3114.9428 3130.4510 3149.2655 3174.9201
redmass: 2.8365 3.0019 2.9973 3.3270 2.9267 1.0541 1.0545 1.7239 2.8800 1.0327 1.3681 1.1717 1.2559 1.9250 2.0329 2.7165 2.6155 2.7215 2.3607 2.4783 2.7824 3.0343 3.0453 3.0508 2.7807 4.3294 5.8258 1.7893 4.6193 1.6329 2.6520 2.4068 1.5504 1.7151 1.5614 1.4484 1.6494 1.6463 1.2025 1.2067 1.3420 6.1760 1.4095 1.4009 1.3811 1.3860 2.1613 1.6549 2.0655 1.0935 2.9836 2.9984 2.6515 2.8589 2.4623 3.6538 1.3381 3.8435 1.1852 1.1855 1.2206 1.3896 1.2050 1.2212 2.8869 1.0503 1.0504 1.2315 1.0481 1.0482 1.0475 1.1721 1.0572 1.0506 1.0500 1.4280 1.1042 1.0730 5.4883 6.1438 1.0350 1.0350 1.0350 1.0349 1.0360 1.0359 1.0999 1.0997 1.1000 1.0997 1.1003 1.1004 1.0985 1.0983 1.0994 1.0994 1.0990 1.0989 1.0846 1.0904 1.0983 1.0886
irintensity: 0.0370 0.1432 0.0000 0.1831 1.0547 0.0068 0.0058 0.0388 0.0005 0.0071 0.0000 0.0000 0.0163 1.0454 0.0628 0.0136 0.2533 0.3099 0.0000 0.0761 0.1353 5.6122 0.0004 0.0113 0.0334 0.0000 0.0190 30.0631 0.1115 31.6691 0.6562 28.8568 0.0063 0.0653 0.0035 11.0183 0.3529 3.5044 0.5833 0.0003 0.3725 0.0794 0.5946 3.2468 0.0001 0.3697 15.7705 0.7255 1.0038 0.2994 8.4989 4.8244 3.4960 8.9956 58.3477 12.7489 0.7203 3.9825 7.5127 31.8570 35.9357 3.4760 15.8853 1.6744 17.3331 0.0032 0.1439 5.9394 0.0031 1.2838 2.6304 16.6415 17.7813 0.0348 24.6637 0.1414 39.0196 13.7189 8.1833 34.3522 27.0766 38.0450 24.9078 43.6207 51.8707 13.6503 4.1219 0.8624 5.8152 4.8165 4.1082 41.2800 216.6653 37.9811 7.7640 46.9474 13.5463 84.7110 1.6409 36.9250 33.7090 4.4957
temp: 298.150 k
press: 1.00000 atm
elementType: 6 6 6 6 6 6 6 6 6 6 6 6 6 6 1 1 1 1 1 1 1 1 1 1 1 1 1 1 1 1 1 1 1 1 1 1
symmnumber: 1
zpe: 838906.2 jmol-1
zpe.correction: 0.319522 hartree
zpe.thermalcorrener: 0.335202 hartree
zpe.thermalcorrenthalpy: 0.336146 hartree
zpe.thermalcorrgfe: 0.278195 hartree
zpe.sumelectzpe: -545.602440 hartree
zpe.sumelectthermal: -545.586761 hartree
zpe.sumelectthermalent: -545.585817 hartree
zpe.sumelectthermalfe: -545.643768 hartree
dipole: 0.0001 -0.4135 -0.0001
dipole: 0.4135
quadrupole: -82.4848 -84.6138 -91.6284
quadrupole: 0.0016 -0.0001 -0.0001
quadrupole: 3.7575 1.6285 -5.3861 0.0016 -0.0001 -0.0001
hfenergy: -545.9219629 hartree
pointgroup: C01 [X(C14H22)]
dipole: 0.000654 -0.1626777 0.0000698 debye
polarizability: 187.9657985|0.1553673|150.5563587|0.0068762|-0.0121272|109.4480061 unknown
InChI: InChI=1S/C14H22/c1-13(2,3)11-8-7-9-12(10-11)14(4,5)6/h7-10H,1-6H3
charge 0 multiplicity 1
36 atoms
C  -2.596451 -0.540895 -0.000373
C  2.609164 -0.519045 0.000115
C  -1.24189 0.213026 -0.000474
C  1.248885 0.223266 -0.000268
C  0.006241 -0.461644 -0.00016
C  -3.407324 -0.145235 -1.271434
C  -3.407848 -0.144026 1.269962
C  -2.421018 -2.080859 0.000412
C  3.417137 -0.11524 1.270795
C  3.417526 -0.115922 -1.270533
C  2.44765 -2.060577 0.000498
C  -1.226822 1.632715 -0.00087
C  1.222032 1.642753 -0.0007
C  -0.005261 2.337894 -0.000988
H  0.010633 -1.553643 0.000177
H  -4.386127 -0.661538 -1.277382
H  -3.596737 0.942173 -1.311795
H  -2.860128 -0.427231 -2.189662
H  -3.597081 0.943449 1.309338
H  -4.38675 -0.660142 1.275872
H  -2.861144 -0.42536 2.188687
H  -3.414118 -2.566884 0.000456
H  -1.876598 -2.431442 -0.895953
H  -1.876949 -2.430558 0.897335
H  4.400386 -0.622889 1.276369
H  3.596525 0.973876 1.310142
H  2.872735 -0.401482 2.189361
H  3.596953 0.973168 -1.310408
H  4.400768 -0.623593 -1.275543
H  2.873397 -0.402642 -2.189111
H  3.445045 -2.537679 0.000763
H  1.90642 -2.415279 0.897155
H  1.906665 -2.415746 -0.896122
H  -2.168534 2.194342 -0.001071
H  2.159209 2.212006 -0.000791
H  -0.009791 3.434182 -0.0013
