program: Gaussian 09
title: 000136809
version: EM64L-G09RevD.01
frameworkgroup: C1[X(C13H11N)]
method: RPBEPBE
basis: SDD
operation: Freq
keyword: #pfreq=noraman
keyword: PBEPBE/SDD
title: #p freq=noraman PBEPBE/SDD
converged: YES YES NO NO
title: Mulliken charges:
elementType: N C C C C C C C C C C C C C H H H H H H H H H H H
charge: -0.296832 0.355244 0.238225 -0.133179 -0.354239 -0.361476 -0.364198 -0.361637 -0.241069 -0.218821 -0.225804 -0.218754 -0.234389 -0.238380 0.250121 0.250607 0.284831 0.250615 0.227132 0.230535 0.228778 0.230531 0.229568 0.230984 0.241606
chargesum: 0.00000
title: Mulliken charges with hydrogens summed into heavy atoms:
elementType: N C C C C C C C C C C C C C
charge: -0.055226 0.355244 0.238225 -0.133179 -0.104118 -0.110869 -0.079367 -0.111022 -0.013937 0.011714 0.002974 0.011777 -0.004821 -0.007396
polarizability: 1.93949307e+02 5.96360461e+00 1.33672346e+02 6.92314367e-02 -3.95832538e-02 9.89300793e+01
1716.lowfreq: -45.4981 -7.2682 -0.0009 -0.0008 0.0002 5.6626 13.7355 42.6210 70.6413
frequency: -45.4809 42.3828 70.6336 127.1528 202.3874 212.1741 280.7598 339.2292 393.6495 402.4949 440.3246 442.1804 571.4256 611.3305 614.3825 617.5003 674.9747 698.6303 702.8215 714.0461 772.0407 788.3162 853.6585 864.0845 876.0018 890.0491 925.4378 949.7335 976.6175 987.1433 989.4424 993.0115 996.0392 1010.6049 1023.0556 1027.0934 1079.2657 1081.1871 1144.5028 1167.7524 1173.4214 1173.5806 1187.7236 1190.9456 1308.8111 1312.5665 1348.9755 1369.8896 1387.2408 1428.4093 1436.9357 1473.9340 1484.2260 1558.4361 1582.6170 1591.2603 1608.3470 1610.1677 3123.7836 3124.5542 3129.0534 3134.6425 3140.1652 3147.2919 3150.1004 3159.2355 3164.9853 3168.7474 3315.6121
redmass: 4.1907 3.8416 4.8932 4.6301 4.6095 4.5203 5.1580 4.3935 2.8180 2.8503 5.3587 3.3021 4.0518 6.2572 6.4226 5.1754 4.4207 1.6579 1.8255 4.7602 2.0613 2.0229 1.2451 1.2436 3.4428 1.1776 1.4715 1.4436 1.3862 6.2644 6.2574 1.3613 1.3090 1.3343 2.2957 2.1382 1.6015 1.5550 2.0170 1.8585 1.0535 1.1293 1.1286 1.1830 1.4828 1.3623 2.1759 6.8831 9.0878 2.2082 2.2477 2.1967 2.5049 7.1063 5.9439 6.6855 6.0722 6.1265 1.0846 1.0848 1.0878 1.0884 1.0925 1.0932 1.0968 1.0964 1.1018 1.0996 1.0757
irintensity: 0.2542 0.3598 0.4391 0.0145 3.0636 1.3786 0.2333 6.9744 0.0001 0.2687 2.7463 9.5127 7.2618 0.0886 0.0801 41.9478 1.7219 66.3349 55.8879 4.2126 46.8294 21.0713 2.3926 2.5437 31.7994 55.2945 0.1132 12.2936 0.0140 0.5339 0.5691 0.5652 0.0663 0.8617 4.2870 12.1458 6.8614 8.0494 53.2448 35.8474 0.0204 13.3119 2.6277 16.7312 10.8459 0.3752 104.9080 0.0800 4.5301 7.4192 35.5723 7.6628 1.8455 66.9517 1.6394 6.6629 1.6951 0.4033 1.8548 0.2590 0.0799 8.1570 14.5626 25.0707 33.8017 16.7429 23.4851 19.0556 8.4485
temp: 298.150 k
press: 1.00000 atm
elementType: 7 6 6 6 6 6 6 6 6 6 6 6 6 6 1 1 1 1 1 1 1 1 1 1 1
symmnumber: 1
zpe: 523600.6 jmol-1
zpe.correction: 0.199429 hartree
zpe.thermalcorrener: 0.209811 hartree
zpe.thermalcorrenthalpy: 0.210755 hartree
zpe.thermalcorrgfe: 0.162500 hartree
zpe.sumelectzpe: -555.758789 hartree
zpe.sumelectthermal: -555.748407 hartree
zpe.sumelectthermalent: -555.747463 hartree
zpe.sumelectthermalfe: -555.795718 hartree
dipole: -1.2754 -1.8933 -0.0032
dipole: 2.2828
quadrupole: -68.8906 -82.8754 -79.7006
quadrupole: -1.1579 0.0139 -0.0283
quadrupole: 8.2649 -5.7199 -2.5451 -1.1579 0.0139 -0.0283
hfenergy: -555.9582179 hartree
pointgroup: C01 [X(C13H11N1)]
dipole: 0.4940918 0.7500022 0.0004821 debye
dipolederiv: -0.5181834 -0.0813118 -0.0000686 0.2442464 -0.8831523 -0.0003238 -0.0003852 -0.0009687 -0.4042739 -0.3773649 0.1279716 0.0001686 0.0184006 -0.1338285 -0.0000642 0.0001626 0.0001396 -0.0063688 0.0288398 0.0429771 0.0000544 0.111095 -0.0916203 0.0000246 0.0001649 0.0000543 0.0651194 1.1383249 -0.175451 -0.0001779 -0.4109076 0.6733378 0.0002445 -0.000026 0.0006263 -0.0148478 0.0391293 0.0690513 -0.0001518 -0.0742614 -0.0071113 0.0000004 -0.0003557 0.0000121 -0.1183612 -0.138561 0.0061091 -0.0536645 0.0195551 -0.1303044 -0.0130179 -0.0131807 -0.0116939 0.0525103 -0.0557385 -0.0972631 -0.0000548 0.1143367 0.0446716 -0.000036 0.0000915 0.0000982 -0.112177 -0.1381936 0.0066879 0.0530801 0.0184682 -0.130804 0.0139394 0.012334 0.0124686 0.0527678 -0.2033128 0.0136433 0.0000224 -0.0475003 0.1561331 0.0000264 -0.0000257 0.0000531 -0.1575064 -0.0281342 0.0551337 0.0717476 0.0787674 -0.0990871 0.0354492 0.0599063 0.0261373 0.0878963 0.0853804 0.1340248 -0.0001274 0.1647206 -0.101559 -0.0000532 -0.0001028 -0.0000654 -0.1585452 -0.0276827 0.0548181 -0.0723058 0.0787012 -0.0993722 -0.0343706 -0.060371 -0.0251304 0.0878053 0.0549269 -0.0486249 -0.0001129 -0.0486444 0.0332912 0.0000405 -0.0000878 0.0000084 -0.1492472 0.0299779 0.1093416 -0.0001367 0.0966383 -0.1122372 0.0002375 -0.0002408 0.0002504 -0.0740937 -0.0100389 -0.0800437 0.0000851 -0.1268759 0.0560719 0.0000265 0.0002317 -0.0000595 0.1182504 0.0798764 -0.0394237 0.0847345 -0.0480792 0.1107656 0.0354869 0.0767907 0.0227486 -0.0321402 0.1550059 0.0070016 0.0000178 -0.0351748 -0.0056814 0.0000324 -0.0000563 -0.0000128 0.1504357 0.0801867 -0.0397793 -0.0842082 -0.0481874 0.1105758 -0.0364535 -0.0760696 -0.0234837 -0.0322402 0.0754016 -0.010084 0.0000267 0.0230996 -0.1293449 -0.0000024 0.0000774 -0.0000263 0.1553088 0.0404761 -0.0513008 -0.0749004 -0.0645258 0.1261935 -0.0404162 -0.0950397 -0.0431109 -0.0681146 -0.1093687 -0.0784155 0.0001221 -0.0913316 0.0389481 0.0000383 0.0001141 0.0000322 0.1543404 0.0399618 -0.0510918 0.0754968 -0.0641444 0.1266365 0.0393492 0.0956533 0.042062 -0.0680614 -0.0842125 0.0993928 0.0001215 0.1058265 0.0316267 -0.000058 0.0001203 -0.0000577 0.1578874 -0.0792542 -0.1130621 0.000056 -0.1243261 0.1010723 -0.0001975 0.0000612 -0.0001836 0.0878235 -0.0774423 0.1396987 0.0001754 0.1101032 0.3147784 0.0000974 0.0002334 0.0001017 0.2258325 unknown
polarizability: 193.8201987|6.5825503|133.8009771|-0.0852752|0.1262507|98.9305569 unknown
InChI: InChI=1S/C13H11N/c14-13(11-7-3-1-4-8-11)12-9-5-2-6-10-12/h1-10,14H
charge 0 multiplicity 1
25 atoms
N  -0.116053 -2.470321 -0.00221
C  -1.311464 -0.359893 -0.000141
C  1.275293 -0.418428 -0.000675
C  -0.04511 -1.154571 -0.000828
C  -1.288249 1.061187 -0.000064
C  1.912885 -0.088195 1.223632
C  -2.567166 -1.02967 0.000366
C  1.916456 -0.094164 -1.224719
C  -2.494122 1.796604 0.000559
C  3.175514 0.546771 1.222897
C  -3.767657 -0.294306 0.000995
C  3.179039 0.5409 -1.223401
C  -3.736508 1.122946 0.001103
C  3.812554 0.86193 -0.000103
H  -0.327565 1.587552 -0.000544
H  1.419245 -0.329353 2.172119
H  -2.565274 -2.124049 0.000263
H  1.42556 -0.339924 -2.173448
H  -2.465217 2.891971 0.000602
H  3.659792 0.794567 2.174101
H  -4.729149 -0.820192 0.001421
H  3.666031 0.784195 -2.174383
H  -4.671895 1.694165 0.001585
H  4.791613 1.353997 0.000122
H  0.828446 -2.911019 -0.002848
