program: Gaussian 09
title: 000136808
version: EM64L-G09RevD.01
frameworkgroup: C1[X(C14H14)]
method: RPBEPBE
basis: SDD
operation: Freq
keyword: #p
keyword: freq=noraman
keyword: PBEPBE/SDD
title: #p freq=noraman PBEPBE/SDD
converged: NO YES NO NO
title: Mulliken charges:
elementType: C C C C C C C C C C C C C C H H H H H H H H H H H H H H
charge: 0.102432 -0.516448 -0.424199 -0.412152 -0.537234 0.300974 0.185748 -0.412559 0.426311 -0.482484 -0.385069 -0.431700 -0.261814 -0.248979 0.219575 0.220035 0.203601 0.208805 0.205188 0.206741 0.222536 0.218440 0.230249 0.234232 0.240769 0.237237 0.223541 0.226224
chargesum: 0.00000
title: Mulliken charges with hydrogens summed into heavy atoms:
elementType: C C C C C C C C C C C C C C
charge: 0.102432 -0.076839 -0.011794 -0.000223 -0.096257 0.300974 0.185748 -0.182310 0.426311 -0.248252 -0.144300 -0.194463 -0.038272 -0.022755
polarizability: 2.11410578e+02 -1.30004014e+01 1.60493103e+02 9.64172208e-01 -1.42532840e+00 7.51517103e+01
1716.lowfreq: -10.5001 -0.0007 0.0002 0.0006 3.6709 9.1137 81.4077 97.2318 151.4074
frequency: 81.3632 97.2263 151.4055 210.5270 226.8215 290.0053 309.8023 383.2247 410.1569 432.5049 434.8766 488.6328 512.9287 532.7089 534.6554 607.4752 643.3326 667.7797 717.0228 752.3707 778.8482 816.8145 835.7314 842.7644 854.5787 876.5699 885.7272 911.8197 954.6123 973.5224 978.9730 981.8252 988.9018 1032.0785 1080.5536 1086.0959 1100.5831 1133.7392 1152.0765 1165.6622 1173.4437 1196.2566 1212.0128 1235.8852 1249.7035 1263.0599 1274.1026 1308.9674 1335.1586 1345.1300 1356.3675 1370.4004 1406.0104 1420.7156 1429.2972 1449.2603 1457.8260 1470.8429 1472.2788 1478.2141 1516.4520 1582.6283 1606.1265 1632.3609 2950.9572 2951.4890 2976.9386 2978.6956 3011.9668 3014.7098 3038.6991 3047.0174 3108.2826 3116.8921 3128.5954 3136.3292 3147.4596 3161.9158
redmass: 2.9493 2.8676 2.6961 3.6565 4.0802 2.3084 2.1204 4.0982 2.9285 3.4274 4.2772 3.1340 4.0081 3.2924 3.2068 3.1889 3.3712 4.7700 3.9376 1.2857 2.3244 1.4562 3.5816 1.6513 2.9183 1.7646 2.3049 1.5623 1.3529 1.4965 2.3777 3.1871 1.3433 2.2728 2.0551 2.0324 1.7045 1.1553 1.3673 1.3780 1.2035 1.6325 1.8307 2.0095 1.2921 1.4123 1.4654 1.6867 1.4614 1.4308 1.5911 2.4245 3.2341 3.7151 3.4380 1.3056 1.1030 1.0899 1.6156 1.2144 3.5837 7.4854 5.7824 6.7597 1.0646 1.0646 1.0647 1.0623 1.0926 1.0942 1.0985 1.1042 1.0862 1.0862 1.0885 1.0972 1.0940 1.0997
irintensity: 0.2959 0.2746 0.7908 3.0188 0.7691 4.0264 1.5815 0.9173 3.8516 0.1513 2.3702 1.0171 0.7711 0.1733 7.8606 1.9953 1.7510 1.0103 2.4316 34.7016 22.1186 31.9550 4.7029 31.3581 1.5456 2.1224 5.7678 5.0801 1.9714 2.6226 2.5417 1.2804 0.3676 8.6784 1.3556 1.5772 0.6749 1.9610 0.6056 0.6219 1.2727 4.9235 1.8441 4.0216 4.5727 1.1175 6.2861 3.4108 0.6838 2.0377 0.2415 5.7977 2.4091 11.5262 0.1238 0.3929 13.3251 10.2524 9.0696 3.0757 12.0892 2.5044 6.2028 5.4773 42.5777 11.8651 35.3470 31.1160 53.9397 15.7799 74.6419 67.1999 8.6341 2.5147 5.8389 34.1815 36.6737 31.2427
temp: 298.150 k
press: 1.00000 atm
elementType: 6 6 6 6 6 6 6 6 6 6 6 6 6 6 1 1 1 1 1 1 1 1 1 1 1 1 1 1
symmnumber: 1
zpe: 621632.0 jmol-1
zpe.correction: 0.236767 hartree
zpe.thermalcorrener: 0.247421 hartree
zpe.thermalcorrenthalpy: 0.248365 hartree
zpe.thermalcorrgfe: 0.200682 hartree
zpe.sumelectzpe: -540.924951 hartree
zpe.sumelectthermal: -540.914296 hartree
zpe.sumelectthermalent: -540.913352 hartree
zpe.sumelectthermalfe: -540.961036 hartree
dipole: -0.9167 -0.2311 0.0118
dipole: 0.9455
quadrupole: -74.1048 -74.8610 -87.6884
quadrupole: 0.0996 0.2202 -0.3393
quadrupole: 4.7799 4.0237 -8.8036 0.0996 0.2202 -0.3393
hfenergy: -541.1617176 hartree
pointgroup: C01 [X(C14H14)]
dipole: -0.3590701 0.0970124 -0.0047852 debye
polarizability: 211.8360154|12.1267085|160.0593416|-1.064134|-1.6265759|75.1600341 unknown
InChI: InChI=1S/C14H14/c1-3-7-13-11(5-1)9-10-12-6-2-4-8-14(12)13/h1,3,5,7,9-10H,2,4,6,8H2
charge 0 multiplicity 1
28 atoms
C  -0.717598 0.352865 0.021603
C  -1.480338 1.677976 0.015341
C  -2.981692 1.5340 0.349903
C  -3.602891 0.349797 -0.417757
C  -2.925622 -0.96245 0.026899
C  -1.400776 -0.877185 0.031961
C  0.731544 0.363848 -0.00033
C  -0.658884 -2.106102 0.0505
C  1.463944 -0.888239 0.021708
C  0.7317 -2.120005 0.052669
C  1.492157 1.58192 -0.049852
C  2.897054 -0.873394 0.006691
C  2.890148 1.567983 -0.067686
C  3.603782 0.330018 -0.035879
H  -1.015334 2.380287 0.73423
H  -1.371541 2.151297 -0.984054
H  -3.10573 1.360959 1.438075
H  -3.505489 2.478975 0.111026
H  -3.456127 0.499728 -1.506316
H  -4.693363 0.293622 -0.238794
H  -3.240475 -1.801737 -0.623688
H  -3.27637 -1.221507 1.04888
H  -1.216217 -3.051623 0.059919
H  1.282218 -3.068323 0.067473
H  0.970559 2.543702 -0.080933
H  3.431869 -1.831028 0.027503
H  3.44532 2.512147 -0.106872
H  4.699351 0.330368 -0.047121
