program: Gaussian 09
title: 000136819
version: EM64L-G09RevD.01
frameworkgroup: C1[X(C28H20)]
method: RPBEPBE
basis: SDD
operation: Freq
keyword: #p
keyword: freq=noraman
keyword: PBEPBE/SDD
title: #p freq=noraman PBEPBE/SDD
converged: YES YES NO NO
title: Mulliken charges:
elementType: C C C C C C C C C C C C C C C C C C C C C C C C C C C C H H H H H H H H H H H H H H H H H H H H
charge: 0.056095 -0.033212 -0.031488 0.241414 0.240482 0.281950 0.296936 0.296476 -0.392285 -0.392131 -0.397614 -0.397680 -0.394533 -0.434853 -0.394823 -0.434867 -0.235791 -0.235975 -0.180666 -0.235735 -0.235691 -0.229589 -0.236372 -0.229830 -0.236833 -0.249706 -0.250765 -0.250851 0.256263 0.256621 0.256339 0.256677 0.251936 0.258338 0.252451 0.258838 0.206039 0.205983 0.205618 0.225787 0.225762 0.225608 0.224212 0.225591 0.224242 0.226965 0.227336 0.227331
chargesum: 0.00000
title: Mulliken charges with hydrogens summed into heavy atoms:
elementType: C C C C C C C C C C C C C C C C C C C C C C C C C C C C
charge: 0.056095 -0.033212 -0.031488 0.241414 0.240482 0.281950 0.296936 0.296476 -0.136022 -0.135510 -0.141275 -0.141003 -0.142597 -0.176515 -0.142372 -0.176030 -0.029752 -0.029993 0.024952 -0.009948 -0.009929 -0.003981 -0.012160 -0.004240 -0.012591 -0.022741 -0.023429 -0.023520
polarizability: 4.00353068e+02 -2.52717661e-01 4.44435068e+02 1.85718004e+01 1.45233422e-03 1.79246987e+02
1716.lowfreq: -9.2949 -5.0709 -0.0004 -0.0003 0.0007 4.0283 27.7147 43.2208 50.7186
frequency: 27.6741 43.1489 50.6488 53.6351 57.2634 60.6071 70.4624 88.8557 96.1297 154.2552 172.5873 200.9826 221.1104 234.9997 239.0749 269.9293 277.6202 313.7537 359.4291 366.4136 403.1064 404.9546 407.1732 410.9178 437.0409 476.3517 497.0859 507.7260 528.0046 541.6393 589.0360 612.2336 614.7442 615.9652 623.5681 638.9904 651.7835 700.7383 702.9401 703.9933 710.2502 725.4668 734.3464 751.0991 767.7883 782.7217 797.8744 799.0180 847.8782 854.1349 855.3479 856.4303 866.8863 877.6238 923.8684 924.5647 929.2117 943.8313 950.7095 966.4971 977.8065 979.7742 980.2263 987.4706 987.7766 988.6218 992.7219 994.0922 995.8231 997.1217 1006.8206 1024.3814 1024.8106 1030.3156 1046.1744 1075.7446 1079.0398 1082.4851 1107.5035 1155.5619 1171.2191 1171.2694 1172.3571 1189.3052 1189.3850 1192.9019 1196.2903 1221.5561 1263.6334 1302.7667 1309.1893 1310.4410 1318.3843 1329.5195 1366.6256 1367.5594 1370.9870 1394.7600 1412.7552 1420.0710 1430.1147 1434.5371 1435.7291 1444.1106 1446.4135 1490.3835 1494.0803 1503.4828 1515.2469 1531.7655 1577.3121 1578.5924 1580.5560 1599.3839 1601.5150 1608.7704 1610.4421 1617.6078 3089.8087 3098.3404 3104.6706 3119.7907 3120.1466 3121.6932 3122.6450 3127.1123 3127.5450 3131.8429 3134.2015 3140.0517 3140.4154 3145.0454 3149.3632 3149.9159 3153.5500 3163.3616 3163.6465 3165.1113
redmass: 5.4896 3.8045 4.5723 4.8742 4.4387 4.8909 4.0032 3.9158 4.7027 4.7665 4.7236 4.8653 6.5865 4.4418 4.9953 4.3565 5.7926 4.2897 3.8872 5.3415 2.8568 3.0347 2.8807 4.1271 5.1902 5.6392 5.2116 3.9726 4.1516 4.1537 2.7894 6.2548 6.1143 6.3997 6.1512 6.7739 6.6079 2.4531 2.0954 1.9241 2.0936 2.0177 2.7587 1.4146 2.8060 2.4770 3.1421 3.9607 5.6346 1.2664 1.2485 1.2495 1.5538 3.8939 1.4287 1.4359 1.4564 7.4087 3.1568 1.3892 1.3944 1.3777 1.4286 5.7719 5.1824 5.8675 1.3482 1.3202 1.3096 1.3495 1.3548 2.5394 2.3969 2.0432 2.7051 1.7205 1.6350 1.6405 2.8848 3.6384 1.0534 1.0532 1.0578 1.1276 1.1212 1.1192 2.1097 1.6842 2.4150 1.3176 1.4042 1.4499 1.3899 1.5945 4.7067 5.8320 5.6284 1.8424 2.6726 2.7658 2.0309 2.2013 2.6835 2.2383 2.9893 3.2567 3.0994 3.7189 7.6163 3.1919 5.7777 5.9196 5.9086 4.8702 7.0710 6.1242 6.1506 7.1600 1.0822 1.0854 1.0886 1.0856 1.0847 1.0911 1.0845 1.0875 1.0876 1.0879 1.0956 1.0927 1.0927 1.0925 1.0962 1.0962 1.0963 1.1015 1.1014 1.1013
irintensity: 0.0212 0.0084 0.6245 0.1215 0.5879 1.4045 0.1311 0.0150 0.4260 0.0314 0.7408 0.0929 0.0028 0.0122 0.0001 0.1255 0.8411 2.3458 0.0526 2.6377 0.2100 0.1585 1.0412 0.1003 0.7836 0.6551 3.6882 1.2550 11.1754 2.2857 7.6165 4.4125 4.1845 0.0067 19.3933 7.1994 5.2998 56.5174 7.7371 38.7475 5.5872 83.0874 28.2695 57.2817 22.2137 16.1470 24.4227 5.4191 4.4153 0.3109 0.1984 0.4399 0.3203 3.9735 1.1592 0.9372 6.5691 0.3526 4.8085 1.2784 0.0077 0.7797 0.0631 0.1211 0.4515 0.4451 0.1779 0.0518 0.4409 0.1021 0.0575 12.0539 21.4546 2.1975 3.0678 2.0044 7.4362 14.2720 2.2631 0.5150 0.0201 0.0107 0.0054 0.0332 0.2386 1.8443 6.3502 3.1718 6.1223 0.0783 0.9471 2.1655 0.8933 0.6729 1.1988 0.7984 0.4848 10.7568 12.5878 46.5990 7.8341 0.4650 65.0458 4.1316 50.5575 36.1925 13.0134 7.0949 10.6304 6.8221 4.1015 2.1671 0.8027 8.2645 43.0733 36.1825 7.6599 12.9373 0.9456 0.5199 10.1297 23.5845 1.6660 20.9920 0.9543 1.8083 2.0212 3.5881 56.3685 24.2651 22.3146 23.7987 36.7932 32.5611 29.7878 32.8661 19.7231 23.9709
temp: 298.150 k
press: 1.00000 atm
elementType: 6 6 6 6 6 6 6 6 6 6 6 6 6 6 6 6 6 6 6 6 6 6 6 6 6 6 6 6 1 1 1 1 1 1 1 1 1 1 1 1 1 1 1 1 1 1 1 1
symmnumber: 1
zpe: 1002743.8 jmol-1
zpe.correction: 0.381925 hartree
zpe.thermalcorrener: 0.403774 hartree
zpe.thermalcorrenthalpy: 0.404718 hartree
zpe.thermalcorrgfe: 0.329939 hartree
zpe.sumelectzpe: -1077.102486 hartree
zpe.sumelectthermal: -1077.080638 hartree
zpe.sumelectthermalent: -1077.079694 hartree
zpe.sumelectthermalfe: -1077.154472 hartree
dipole: -0.0079 0.6943 0.0114
dipole: 0.6945
quadrupole: -145.5730 -142.0147 -161.0364
quadrupole: -0.0169 5.0484 0.0150
quadrupole: 3.9683 7.5267 -11.4950 -0.0169 5.0484 0.0150
hfenergy: -1077.4844114 hartree
pointgroup: C01 [X(C28H20)]
dipole: -0.0284753 -0.2716993 0.0041374 debye
polarizability: 395.9712483|5.4670952|443.8195176|-37.4781184|4.5037994|184.2443571 unknown
InChI: InChI=1S/C28H20/c1-5-13-21(14-6-1)26-24-19-11-4-12-20-25(24)27(22-15-7-2-8-16-22)28(26)23-17-9-3-10-18-23/h1-20H
charge 0 multiplicity 1
48 atoms
C  0.036394 0.329448 -0.005339
C  1.10115 -0.632624 -0.122116
C  -1.222918 -0.359119 0.111209
C  0.522586 -1.941883 -0.068462
C  -0.964023 -1.767138 0.057824
C  0.21137 1.803599 -0.004627
C  2.555348 -0.341567 -0.185278
C  -2.569328 0.2618 0.182511
C  1.241469 -3.153891 -0.04313
C  -1.943667 -2.780179 0.034048
C  1.040313 2.439186 -0.970856
C  -0.445396 2.61614 0.961594
C  3.172781 0.513472 0.77071
C  3.375796 -0.920064 -1.195194
C  -2.973871 1.24912 -0.759649
C  -3.497709 -0.120823 1.192468
C  0.758067 -4.483416 0.002768
C  -1.780674 -4.185476 -0.012002
C  -0.582125 -4.937969 -0.004779
C  1.203322 3.840604 -0.974204
C  -0.274241 4.016648 0.964503
C  4.557954 0.776294 0.721414
C  4.763189 -0.658578 -1.244307
C  -4.258886 1.828096 -0.696996
C  -4.785356 0.456553 1.254239
C  0.548738 4.636672 -0.005066
C  5.361987 0.190183 -0.284904
C  -5.173252 1.433548 0.308602
H  2.334968 -3.049021 -0.056407
H  -2.983409 -2.425616 0.049172
H  1.550127 1.829288 -1.724001
H  -1.084717 2.143352 1.714526
H  2.558964 0.965176 1.557359
H  2.914144 -1.553959 -1.961281
H  -2.275121 1.553954 -1.545914
H  -3.192575 -0.852653 1.949466
H  1.526926 -5.266969 0.028009
H  -2.709942 -4.769973 -0.036391
H  -0.710268 -6.029936 -0.004667
H  1.842119 4.31032 -1.730627
H  -0.784546 4.62363 1.720833
H  5.011028 1.436256 1.469977
H  5.373301 -1.110768 -2.03475
H  -4.548514 2.584751 -1.435036
H  -5.480628 0.150501 2.04444
H  0.678225 5.724921 -0.00522
H  6.437834 0.395086 -0.322396
H  -6.171133 1.883926 0.356128
