program: Gaussian 09
title: 000136816
version: EM64L-G09RevD.01
frameworkgroup: C1[X(C13H15ClO4)]
method: RPBEPBE
basis: SDD
operation: Freq
keyword: #p
keyword: freq=noraman
keyword: PBEPBE/SDD
title: #p freq=noraman PBEPBE/SDD
converged: YES YES NO NO
title: Mulliken charges:
elementType: Cl O O O O C C C C C C C C C C C C C H H H H H H H H H H H H H H H
charge: -0.055648 -0.206663 -0.236814 -0.192397 -0.230872 0.224540 0.219024 0.575336 -0.574213 -0.268758 -0.357449 0.113311 -0.800234 -0.378021 -0.798479 0.249169 -0.215557 -0.672949 0.256543 0.272041 0.251531 0.251047 0.224489 0.234740 0.227836 0.238341 0.236765 0.263697 0.240343 0.227445 0.211240 0.226190 0.244427
chargesum: 0.00000
title: Mulliken charges with hydrogens summed into heavy atoms:
elementType: Cl O O O O C C C C C C C C C C C C C
charge: -0.055648 -0.206663 -0.236814 -0.192397 -0.230872 0.224540 0.219024 0.575336 -0.317671 0.003283 -0.357449 0.113311 -0.073166 0.084555 -0.059676 0.249169 0.252231 0.008908
polarizability: 2.32660110e+02 -1.33469702e+01 1.78922321e+02 9.97422190e+00 8.98125870e-01 1.03824744e+02
1716.lowfreq: -16.9533 -7.3916 -0.0020 -0.0014 -0.0012 3.5157 5.3059 16.7451 24.2659
frequency: -15.4956 16.6513 24.2125 48.0313 50.4189 68.8803 90.2018 109.2866 119.0847 147.2430 154.8432 180.2352 183.7484 201.1385 230.8570 236.5359 252.6103 301.1995 333.6242 338.6354 343.6866 359.8375 403.4868 429.4448 448.3080 514.4894 552.5495 582.4654 593.1566 634.7146 637.2028 683.4194 713.4415 733.9832 766.2445 789.8644 799.0440 855.0964 886.6120 918.2092 929.1768 941.0519 994.5298 1005.0366 1016.2887 1020.5554 1026.2322 1043.8345 1056.9209 1115.3203 1134.6620 1165.9139 1183.3732 1231.3102 1249.1389 1252.0178 1259.6336 1278.1422 1345.1247 1357.8475 1365.2821 1368.7471 1380.0803 1400.8050 1401.9766 1451.1008 1452.3054 1458.1060 1462.9253 1468.2665 1469.0512 1471.9572 1483.8087 1485.3868 1546.3700 1598.8585 1606.0566 1644.7464 2984.1505 2984.5138 2987.7101 2997.7052 3012.8485 3066.6274 3067.2171 3071.4687 3074.1120 3094.3359 3099.3161 3111.8444 3124.3184 3158.8351 3183.6123
redmass: 3.0406 6.0878 4.9991 3.1375 5.9460 4.5842 4.8725 1.0455 3.5924 4.6704 5.6122 2.6724 1.0923 3.8284 3.6220 3.0488 1.7429 5.5779 5.4324 5.6042 3.8380 6.2372 3.7140 4.4330 2.9713 3.8781 3.2743 5.3986 5.4836 3.8595 4.9075 6.2382 5.6774 2.9023 6.3157 3.5960 1.1154 1.5498 1.4250 3.9632 4.8682 3.8319 1.8082 1.9569 2.2079 1.8096 2.5968 1.5392 2.9970 2.2398 1.4623 1.6773 2.0703 3.3794 1.5104 1.4501 3.6939 1.3998 1.5439 1.7480 2.3329 1.4595 3.9682 1.2695 1.2436 1.1385 1.1170 1.0449 1.0397 1.0583 1.1829 1.0675 2.2506 1.0971 6.0931 8.1711 6.9606 10.2868 1.0557 1.0381 1.0370 1.0359 1.0582 1.1063 1.0970 1.0976 1.1065 1.0985 1.0999 1.1028 1.0988 1.0901 1.0912
irintensity: 0.6486 3.9451 0.9758 1.9177 0.7261 0.5996 1.6856 0.2941 1.5906 0.9270 1.6381 8.0564 1.0474 5.3523 1.5253 0.9499 1.9195 5.5933 3.1614 2.8644 7.8420 3.1442 1.4791 2.2793 3.3544 3.1127 0.9134 1.9415 33.8890 0.0545 2.5584 8.4804 22.8658 0.8823 36.9516 12.9303 3.6845 18.3826 16.9051 12.6875 39.8706 72.6595 9.5296 0.5723 21.3267 3.0251 106.4209 11.4987 54.2396 4.5372 5.8236 193.5583 100.8692 159.7547 102.3577 66.6195 148.5304 24.8276 9.0718 6.5345 34.7485 85.9398 7.8797 23.9567 11.7493 52.0525 11.5598 14.2549 11.3525 19.6737 16.2097 3.1988 62.5049 25.2139 70.1090 185.6496 43.8014 216.2585 32.4746 2.5795 14.3892 18.7523 18.9998 14.3619 12.2544 13.6990 6.6907 29.4359 16.4973 37.9641 13.8841 11.1730 0.1462
temp: 298.150 k
press: 1.00000 atm
elementType: 17 8 8 8 8 6 6 6 6 6 6 6 6 6 6 6 6 6 1 1 1 1 1 1 1 1 1 1 1 1 1 1 1
symmnumber: 1
zpe: 663169.3 jmol-1
zpe.correction: 0.252588 hartree
zpe.thermalcorrener: 0.271490 hartree
zpe.thermalcorrenthalpy: 0.272434 hartree
zpe.thermalcorrgfe: 0.202672 hartree
zpe.sumelectzpe: -1263.974327 hartree
zpe.sumelectthermal: -1263.955425 hartree
zpe.sumelectthermalent: -1263.954481 hartree
zpe.sumelectthermalfe: -1264.024243 hartree
dipole: 0.7264 -1.9856 2.0750
dipole: 2.9624
quadrupole: -108.1381 -101.8116 -118.3911
quadrupole: 0.6321 -11.1359 -2.1326
quadrupole: 1.3088 7.6353 -8.9441 0.6321 -11.1359 -2.1326
hfenergy: -1264.2269151 hartree
pointgroup: C01 [X(C13H15Cl1O4)]
dipole: 0.2576879 1.001284 -0.5379955 debye
polarizability: 231.7701811|17.0487897|170.6637467|-11.6267616|22.6074816|112.9732473 unknown
InChI: InChI=1S/C13H15ClO4/c1-4-17-13(16)7-18-12-5-8(2)11(14)6-10(12)9(3)15/h5-6H,4,7H2,1-3H3
charge 0 multiplicity 1
33 atoms
Cl 5.087109 0.425527 -0.678514
O  -0.839973 0.200723 0.406995
O  -3.59308 0.840364 -0.169056
O  -0.756852 -2.346418 -0.442566
O  -3.581833 0.897878 2.164577
C  0.528704 0.287263 0.165359
C  1.195221 -0.89843 -0.302781
C  2.651943 1.573287 0.125531
C  1.261586 1.484539 0.371237
C  2.593144 -0.799926 -0.541463
C  3.289277 0.397407 -0.335713
C  0.494738 -2.206837 -0.549176
C  3.403202 2.866259 0.351151
C  -1.531072 1.407189 0.896212
C  1.35362 -3.413337 -0.950188
C  -2.997181 1.018869 1.065027
C  -5.007848 0.342822 -0.158423
C  -5.416957 0.161441 -1.615097
H  0.754295 2.383032 0.734167
H  3.143027 -1.673376 -0.898075
H  4.214111 2.729916 1.089804
H  3.884129 3.212422 -0.581976
H  2.730524 3.660915 0.713149
H  -1.133564 1.717043 1.879743
H  -1.437681 2.229657 0.160225
H  2.139814 -3.626152 -0.202821
H  1.84834 -3.253055 -1.926517
H  0.690539 -4.28765 -1.032059
H  -5.027865 -0.603334 0.410943
H  -5.62923 1.085462 0.374377
H  -6.455102 -0.214315 -1.666311
H  -5.365941 1.117761 -2.163173
H  -4.757241 -0.565844 -2.117088
