program: Gaussian 09
title: 000136802
version: EM64L-G09RevD.01
frameworkgroup: C1[X(C9H13NS)]
method: RPBEPBE
basis: SDD
operation: Freq
keyword: #p
keyword: freq=noraman
keyword: PBEPBE/SDD
title: #p freq=noraman PBEPBE/SDD
converged: YES YES NO NO
title: Mulliken charges:
elementType: S N C C C C C C C C C H H H H H H H H H H H H H
charge: -0.030596 -0.307731 -0.486775 0.423627 -0.282790 -0.708604 -0.379812 -0.438693 -0.222217 -0.220678 -0.242898 0.225477 0.198145 0.208408 0.208523 0.254922 0.255406 0.275126 0.268973 0.231642 0.224533 0.224809 0.227423 0.093779
chargesum: 0.00000
title: Mulliken charges with hydrogens summed into heavy atoms:
elementType: S N C C C C C C C C C
charge: 0.063183 -0.052809 -0.063153 0.423627 0.134141 -0.178072 -0.110839 -0.207051 0.002316 0.004131 -0.015475
polarizability: 1.69790660e+02 -5.11112068e+00 1.08130528e+02 9.61446160e+00 1.44138815e+00 7.43432086e+01
1716.lowfreq: -17.2251 -10.1302 -4.8887 0.0010 0.0019 0.0030 24.5960 43.9117 55.9086
frequency: 23.9092 43.6955 55.8959 93.0500 138.7262 165.1064 212.1461 225.1906 270.1836 343.1621 404.8658 421.4289 483.2310 592.9769 615.9091 684.1994 686.4535 707.9158 742.2038 750.8464 807.9082 844.8215 858.5412 914.9594 968.3771 981.2716 989.8004 996.0312 1010.5374 1024.9716 1052.6152 1079.7024 1098.0695 1137.2880 1162.7675 1170.2644 1181.9202 1211.6886 1227.6227 1257.1579 1276.9103 1303.9968 1332.1161 1371.2266 1390.0249 1439.8653 1447.5175 1454.9178 1474.3135 1483.3269 1490.2401 1593.9406 1614.7403 2432.0210 2867.8547 2894.2502 2971.4660 3003.6459 3032.4017 3110.5165 3113.7811 3124.0872 3137.5767 3151.0550 3163.1682 3437.9060
redmass: 4.3762 2.8598 3.3570 2.6071 2.7525 3.5195 1.2490 3.6397 3.4514 3.9639 2.8588 3.8663 3.3498 4.8176 6.3076 2.9593 1.4009 1.8283 1.2474 1.5399 3.6481 1.1739 1.2474 1.3373 1.9692 1.3931 6.0846 1.4100 1.7620 2.1848 3.1702 1.5887 1.7923 4.0715 1.1120 1.0589 1.1087 2.3524 1.3179 1.2358 1.1180 1.3591 1.2834 1.9609 3.1243 2.1303 1.1070 1.1740 1.2805 1.6769 1.1232 6.1507 6.1181 1.0383 1.0705 1.0692 1.0870 1.0903 1.0591 1.1063 1.0867 1.0866 1.0922 1.0951 1.1011 1.0745
irintensity: 0.2895 0.1389 1.2123 5.7232 5.5093 1.3017 24.8874 3.7710 0.8186 5.3285 0.2916 1.3689 11.5025 3.1501 0.7197 31.9040 61.2272 53.9421 23.4181 51.0913 3.8979 7.5806 0.1004 3.9768 9.4633 0.2726 0.0271 2.9019 13.5651 11.6258 2.1481 11.6001 2.8843 79.0620 12.0419 0.3117 0.5703 2.6582 5.2020 6.1390 1.6137 8.4460 5.0141 0.2195 3.2946 11.8278 10.3396 37.9802 19.8870 8.4375 3.6347 0.6361 6.8455 30.3736 74.9687 93.6735 26.6812 22.7142 23.3156 16.5396 8.9397 0.5481 26.9111 29.5970 21.6332 0.1612
temp: 298.150 k
press: 1.00000 atm
elementType: 16 7 6 6 6 6 6 6 6 6 6 1 1 1 1 1 1 1 1 1 1 1 1 1
symmnumber: 1
zpe: 518881.9 jmol-1
zpe.correction: 0.197632 hartree
zpe.thermalcorrener: 0.209406 hartree
zpe.thermalcorrenthalpy: 0.210351 hartree
zpe.thermalcorrgfe: 0.157538 hartree
zpe.sumelectzpe: -802.711570 hartree
zpe.sumelectthermal: -802.699795 hartree
zpe.sumelectthermalent: -802.698851 hartree
zpe.sumelectthermalfe: -802.751664 hartree
dipole: -1.3778 -0.5596 0.3355
dipole: 1.5244
quadrupole: -83.0540 -70.9566 -73.7573
quadrupole: -0.1966 6.1251 0.0698
quadrupole: -7.1313 4.9660 2.1654 -0.1966 6.1251 0.0698
hfenergy: -802.9092016 hartree
pointgroup: C01 [X(C9H13N1S1)]
dipole: -0.5283989 0.136472 -0.2487518 debye
dipolederiv: -0.3262238 0.1250425 0.0109409 0.1566414 -0.1271494 0.1664679 0.0957878 0.1902399 -0.0348845 -1.0572537 0.0312308 -0.0474248 -0.0150061 -0.4175687 0.1904902 -0.1471519 0.2004681 -0.2868512 0.4428854 -0.0461888 0.145462 0.0972917 0.3826348 -0.0776348 0.4209202 -0.1006429 0.3200811 0.1841738 0.0080897 -0.1047649 -0.0091831 -0.0537662 0.0301985 -0.226738 0.0069336 -0.0074411 0.6011004 0.0942077 -0.0705031 -0.1176629 0.3351403 0.0086478 -0.0759298 -0.0001799 0.1401594 0.3947057 -0.0076558 -0.0196701 -0.0467304 0.0713027 0.0335812 -0.1835272 -0.0071961 0.1150633 -0.1091184 -0.0829427 0.0272387 -0.110819 -0.0435966 -0.0363557 0.0844335 -0.0395405 -0.1503983 -0.1688957 0.0140317 -0.0161764 0.0114028 0.0100095 -0.1164004 -0.0089624 -0.1177749 -0.0992268 -0.0253996 0.0230259 -0.0434341 0.0367408 0.0546702 -0.125164 -0.0539335 -0.129184 -0.0705177 0.0252273 -0.0871809 -0.0003888 -0.1007728 0.0135007 -0.0668521 0.0245481 -0.0706377 -0.1157615 0.0418599 0.0122277 -0.0616803 0.025943 -0.0979769 -0.0475012 -0.0602984 -0.0442891 -0.1321724 -0.0338982 0.0228003 0.0860433 0.0488136 0.0081776 -0.1090614 0.012229 -0.0655027 -0.0877789 -0.0700407 0.0038701 -0.0227194 0.0427579 -0.2257783 0.1476737 -0.1042069 0.0952042 -0.0124979 0.0361172 -0.0081301 -0.0067413 0.0025788 0.0159896 -0.0971387 0.0310933 -0.0793742 -0.1162796 -0.1378688 -0.0628986 0.0208967 -0.1473985 -0.1839987 0.0710665 0.051459 0.0443739 0.0335219 0.1544783 0.0252799 -0.0288392 0.0597626 0.1716821 -0.156787 -0.0041237 -0.0839935 0.0558132 0.0309727 0.015264 0.0381677 0.0184478 0.0595263 -0.0932954 -0.0028841 -0.059666 -0.0733248 -0.0409301 -0.0805081 0.0429749 -0.0226583 -0.0846804 0.0502431 0.0097129 0.0241682 0.065337 0.0732007 0.0980616 -0.0211707 0.118683 0.0401357 0.041012 -0.0256844 0.0457574 0.1229719 0.078648 -0.0623617 0.051093 -0.0421925 -0.0353999 0.1126777 0.0358486 0.1151933 0.0793636 0.0593353 -0.0352436 0.0374633 -0.0552233 -0.0464731 0.1235085 0.0450582 0.123152 0.0755782 -0.0418828 0.1081382 -0.0204001 0.1217339 0.0010435 0.0614065 -0.0217066 0.0617594 0.1289038 -0.1217739 -0.0239285 0.0750203 -0.0233818 0.1014653 0.0402302 0.0808052 0.0417103 0.1214228 0.0105809 -0.0842314 -0.0713877 -0.0497686 0.0511098 -0.151013 0.0232515 -0.1509788 -0.0710815 unknown
polarizability: 169.5550319|-6.8916122|97.8685477|-10.2399887|-15.1565336|84.8408174 unknown
InChI: InChI=1S/C9H13NS/c11-7-6-10-8-9-4-2-1-3-5-9/h1-5,10-11H,6-8H2
charge 0 multiplicity 1
24 atoms
S  5.578094 -0.474039 0.255771
N  1.426116 0.049357 0.124821
C  0.428836 0.486759 -0.878158
C  -1.000445 0.275969 -0.389138
C  2.834582 0.122925 -0.315751
C  3.739036 -0.585201 0.706459
C  -1.34708 -0.88331 0.351133
C  -2.010763 1.222698 -0.691104
C  -2.678586 -1.093102 0.773234
C  -3.345465 1.012199 -0.274161
C  -3.683868 -0.147648 0.460163
H  0.600973 -0.120322 -1.79166
H  0.555045 1.553907 -1.187332
H  2.910929 -0.394235 -1.293072
H  3.206483 1.163963 -0.474184
H  1.277713 0.517626 1.029572
H  3.680802 -0.100996 1.697204
H  3.452898 -1.642649 0.817939
H  -0.558781 -1.604232 0.592982
H  -1.752851 2.12893 -1.253958
H  -2.933656 -1.993174 1.344656
H  -4.116102 1.753208 -0.515627
H  -4.716853 -0.31086 0.78772
H  5.497743 -1.251575 -0.889209
