program: Gaussian 09
title: 000136777
version: EM64L-G09RevD.01
frameworkgroup: C1[X(C8H14O)]
method: RPBEPBE
basis: SDD
operation: Freq
keyword: #pfreq=noraman
keyword: PBEPBE/SDD
title: #p freq=noraman PBEPBE/SDD
converged: YES YES NO NO
title: Mulliken charges:
elementType: O C C C C C C C C H H H H H H H H H H H H H H
charge: -0.452509 0.285589 0.142502 -0.725075 -0.744725 -0.766388 -0.776525 0.261430 -0.537231 0.231872 0.243320 0.198380 0.238749 0.213362 0.212905 0.216796 0.212641 0.227531 0.209111 0.240305 0.250204 0.335658 0.282097
chargesum: 0.00000
title: Mulliken charges with hydrogens summed into heavy atoms:
elementType: O C C C C C C C C
charge: -0.116851 0.285589 0.142502 -0.051502 -0.079709 -0.109420 -0.076905 0.261430 -0.255134
polarizability: 9.91130366e+01 1.16421452e+01 8.61091241e+01 -1.62342259e+00 1.67966805e-01 7.54731132e+01
1716.lowfreq: -13.8907 -0.0007 -0.0007 -0.0004 11.3500 28.0775 66.0947 137.7934 172.2274
frequency: 65.9646 137.7703 172.1869 193.4164 209.0795 227.8699 252.8023 267.2943 271.8955 302.8497 339.4532 346.0132 365.2991 404.5945 432.1538 455.2382 538.8921 556.8479 629.2946 633.7681 663.7996 797.4909 863.2965 892.5526 926.5312 931.0613 946.1732 1004.7734 1016.3380 1066.7920 1076.3611 1118.1591 1226.5651 1230.5784 1235.8054 1312.7477 1368.8033 1375.2744 1385.8547 1402.6261 1455.9704 1464.8679 1466.3685 1472.6508 1475.0211 1486.7020 1491.7924 1498.7476 2139.5705 2973.1808 2977.1566 2983.6376 2993.6776 3066.8947 3068.6633 3071.5946 3076.8092 3080.2305 3089.3833 3092.9373 3106.5478 3427.2388 3547.1780
redmass: 2.6931 3.6938 2.5393 1.0888 1.2349 1.2479 1.2263 1.2800 1.6364 2.3706 2.3549 2.1105 2.6487 2.8484 3.1199 3.3811 3.4632 5.6933 2.2210 1.6810 1.2573 2.8628 2.4715 2.0787 1.5653 1.6330 1.2561 1.6324 1.3820 1.5610 2.5737 2.0204 2.7720 3.0315 2.7651 1.9391 1.2125 1.1978 1.1969 1.1985 1.0499 1.0486 1.0507 1.0482 1.0512 1.0543 1.0526 1.0573 6.0274 1.0354 1.0352 1.0359 1.0364 1.1000 1.0989 1.0988 1.0991 1.0986 1.0978 1.0996 1.0998 1.1598 1.0655
irintensity: 0.6152 1.4431 5.5539 25.3496 105.6589 0.1510 0.3394 19.9131 1.8760 4.2534 0.1478 2.5073 1.7333 0.9567 1.7907 1.5217 1.1419 7.1167 21.4753 55.1453 58.8642 0.6049 26.2921 24.6652 2.0690 2.3498 0.1735 0.4544 0.5641 72.9899 45.9200 58.5418 2.2949 9.2320 8.2142 39.7950 15.4841 19.5872 37.7743 12.9298 1.0036 6.4327 1.9623 0.3624 14.0723 3.5189 9.6208 26.6010 0.5082 31.3170 25.6295 26.8451 19.3264 9.6436 15.9506 38.7845 36.6143 62.3822 27.2055 22.2221 17.4758 58.2490 7.1628
temp: 298.150 k
press: 1.00000 atm
elementType: 8 6 6 6 6 6 6 6 6 1 1 1 1 1 1 1 1 1 1 1 1 1 1
symmnumber: 1
zpe: 515297.9 jmol-1
zpe.correction: 0.196267 hartree
zpe.thermalcorrener: 0.207970 hartree
zpe.thermalcorrenthalpy: 0.208914 hartree
zpe.thermalcorrgfe: 0.160822 hartree
zpe.sumelectzpe: -387.668191 hartree
zpe.sumelectthermal: -387.656488 hartree
zpe.sumelectthermalent: -387.655544 hartree
zpe.sumelectthermalfe: -387.703636 hartree
dipole: 1.4973 0.5928 1.6393
dipole: 2.2980
quadrupole: -54.5543 -52.4222 -60.0461
quadrupole: 3.9558 -2.8078 0.3713
quadrupole: 1.1199 3.2520 -4.3719 3.9558 -2.8078 0.3713
hfenergy: -387.8644578 hartree
pointgroup: C01 [X(C8H14O1)]
dipole: 0.5815211 -0.1953863 -0.6641092 debye
dipolederiv: -0.4662211 -0.2238634 -0.06938 -0.1724998 -0.5789739 0.2171435 -0.1142132 0.2030239 -0.6288743 0.1420363 -0.0230887 0.0313321 0.0811196 0.0363898 0.0070281 -0.0330907 -0.0102034 0.0586283 0.5905244 -0.0293054 0.0284421 -0.0662667 0.6055672 -0.1239986 0.0921336 -0.1839272 0.4975967 0.0009789 -0.0153955 -0.0104912 -0.0078258 -0.043847 -0.0614829 0.0244949 -0.0336766 -0.0588233 -0.0176591 -0.0141539 0.0155225 -0.0101827 0.0000276 0.0741217 -0.0187065 0.0656398 -0.0430293 -0.1367288 0.0527802 -0.0200655 -0.0291188 -0.0054862 0.0167842 0.0080924 0.0145487 0.0535645 -0.0592042 -0.030041 -0.0207102 -0.0346449 -0.0980521 -0.1138121 -0.0446863 -0.0145691 -0.098424 -0.0276845 -0.0047811 -0.0410129 -0.1361073 -0.0576104 0.0336553 0.0665888 -0.0323242 -0.092845 -0.4615186 0.0329709 0.0271692 0.0866679 -0.3450229 -0.0289231 -0.0344631 0.0118117 -0.3093249 -0.0134606 0.1384752 -0.0011782 0.1265717 -0.0269514 -0.0083474 -0.0206156 0.0206885 0.0781616 0.1095322 0.0081809 0.022049 0.01348 0.0651925 0.1099892 0.0149295 0.052586 -0.0856653 -0.1401076 -0.1349163 -0.0290034 -0.1079492 0.0167279 -0.0301682 0.0120897 -0.0071826 0.075882 -0.0437166 0.12586 -0.058273 0.1171469 0.0249104 0.0270219 -0.0336417 0.013408 0.0711671 0.0909761 0.023379 0.0159393 0.0344433 -0.0172466 -0.1441121 0.0166988 -0.0984548 -0.1020363 -0.0855501 -0.1440805 0.0234501 -0.1306273 -0.0224459 0.0261929 -0.0187896 -0.0102564 0.0768844 0.1089101 0.0041786 0.0199758 0.039947 0.0059436 0.1046552 -0.0344508 0.1213134 -0.1077204 0.1075217 0.012161 -0.0079545 0.0457728 -0.0663937 -0.1220636 0.0126812 -0.1437276 -0.056972 -0.1071583 -0.0775444 0.0090098 -0.1408078 0.0077186 0.007265 0.0169205 0.0088653 0.0957392 -0.058836 0.1523684 0.0119082 0.144324 -0.0112763 -0.0204551 0.0127042 -0.0141337 0.0601795 0.1065644 0.0224814 0.0014907 0.0186168 0.0537692 0.099622 -0.0126145 0.0756939 -0.083763 -0.0524781 -0.1209476 0.0011811 -0.1031157 0.0132974 -0.0131102 0.0224604 0.0188853 0.0856044 0.1772736 0.2185485 0.0502694 0.2005593 0.2043075 -0.0630962 0.0592816 -0.0598711 0.2584858 0.2360059 0.0267339 0.0003295 0.0304965 0.2394548 0.0060906 0.0061962 0.001862 0.2555841 unknown
polarizability: 99.4009328|-11.545332|85.806817|0.7009783|0.8599135|75.4875241 unknown
InChI: InChI=1S/C8H14O/c1-6-8(5,9)7(2,3)4/h1,9H,2-5H3
charge 0 multiplicity 1
23 atoms
O  -0.342236 -1.329223 1.309904
C  1.001741 0.319184 -0.043706
C  -0.32213 -0.564868 0.025252
C  1.001057 1.319408 1.142895
C  1.058455 1.104535 -1.380475
C  2.257304 -0.586457 0.075611
C  -0.469035 -1.569507 -1.149798
C  -1.529176 0.292944 0.067748
C  -2.545618 0.988209 0.056018
H  0.191381 2.062963 1.037974
H  0.852847 0.786334 2.098215
H  1.964122 1.861673 1.183003
H  0.136022 1.692507 -1.53732
H  1.199474 0.436914 -2.250164
H  1.909618 1.810033 -1.359977
H  2.302727 -1.092072 1.058222
H  2.310428 -1.349747 -0.722434
H  3.16651 0.035995 -0.009556
H  0.399658 -2.251271 -1.201712
H  -0.561297 -1.051497 -2.118474
H  -1.379086 -2.172949 -0.994144
H  0.288613 -2.088687 1.211123
H  -3.432179 1.595081 0.063494
