program: Gaussian 09
title: 000136770
version: EM64L-G09RevD.01
frameworkgroup: C1[X(C13H14BrNO2)]
method: RPBEPBE
basis: SDD
operation: Freq
keyword: #p
keyword: freq=noraman
keyword: PBEPBE/SDD
title: #p freq=noraman PBEPBE/SDD
converged: YES YES NO NO
title: Mulliken charges:
elementType: Br O O N C C C C C C C C C C C C C H H H H H H H H H H H H H H
charge: -0.043149 -0.200181 -0.200056 -0.220971 -0.371935 -0.366160 -0.362476 -0.319338 0.177913 0.183093 0.083516 0.085441 -0.695843 -0.353189 -0.353655 -0.210865 -0.211151 0.222099 0.231453 0.240215 0.238331 0.202832 0.202143 0.231372 0.232101 0.279571 0.279530 0.270111 0.270163 0.239542 0.239540
chargesum: 0.00000
title: Mulliken charges with hydrogens summed into heavy atoms:
elementType: Br O O N C C C C C C C C C C C C C
charge: -0.043149 -0.200181 -0.200056 -0.220971 0.081618 0.112386 0.042500 0.144135 0.177913 0.183093 0.083516 0.085441 -0.136742 -0.083077 -0.083491 0.028677 0.028389
polarizability: 2.35394827e+02 1.47605682e+00 1.58798299e+02 2.16932081e+01 -3.30996208e+00 1.12788288e+02
1716.lowfreq: -4.8365 -0.0004 -0.0001 0.0003 4.3665 11.3093 14.4662 25.3237 47.2538
frequency: 14.2912 25.2981 47.2117 54.3313 78.2227 120.5234 126.3869 126.9328 138.2505 163.7883 180.6288 230.7499 263.1601 285.6790 318.7299 351.5547 404.0987 436.1331 456.2100 523.2865 533.9702 597.8802 626.6743 659.1067 677.2169 700.1956 717.1394 739.1317 751.5530 785.1547 795.9392 799.6907 854.1556 906.5558 928.2146 945.6369 974.2868 1005.8103 1006.3774 1018.2499 1019.6272 1031.5004 1056.4652 1066.8986 1072.6867 1081.6558 1167.8023 1170.8595 1197.1820 1203.2920 1213.6390 1249.2067 1262.4977 1283.6123 1288.1118 1295.5722 1318.1084 1331.2505 1341.8000 1351.4645 1374.6735 1416.3967 1447.7570 1450.5172 1453.6741 1456.3639 1468.4815 1472.5484 1486.7330 1614.9243 1617.9460 1627.7091 1676.2413 2962.5724 2990.2035 2999.7493 3009.6650 3011.7087 3046.6772 3047.1312 3062.4895 3082.1664 3131.6375 3139.9061 3153.2337 3164.7064 3174.7750
redmass: 7.5282 7.3705 2.6675 2.4242 6.7435 1.8702 2.4786 7.3223 4.9829 7.8478 5.9703 4.3326 3.2297 5.2024 7.7118 5.9436 3.0909 3.6852 4.8719 7.1962 7.0600 9.2740 5.0764 4.7980 5.0356 5.3327 3.0844 1.0925 1.1697 5.0946 1.6738 1.4948 2.9852 1.3918 1.5001 7.1196 1.4134 3.7082 1.3481 2.2196 2.2254 3.7684 1.2190 2.5730 2.6521 3.8463 1.2042 2.0265 1.9425 2.8123 1.1990 1.4166 1.2406 1.4637 1.1549 1.0778 1.3827 1.3040 3.3302 1.5226 1.5219 5.9411 1.3134 1.1025 2.4664 1.9927 1.0667 1.0923 1.1003 7.6947 8.2609 11.0243 11.7255 1.0585 1.0594 1.0596 1.0996 1.0591 1.0563 1.1033 1.1045 1.1061 1.1111 1.0864 1.0906 1.0956 1.1004
irintensity: 0.0201 0.6164 2.3827 0.2175 4.3537 0.0119 0.0581 1.1741 0.0025 6.4684 0.4221 0.1948 3.0210 2.1731 22.8530 1.3011 2.3336 0.7963 0.0040 9.3115 2.3146 3.8687 49.5256 0.0148 0.3380 11.2698 67.3996 13.3986 1.2254 0.0867 31.4968 1.8258 15.7498 0.0131 9.9821 14.0391 2.1772 2.7967 0.0198 39.7107 27.2215 9.8138 12.0653 0.8551 8.3934 2.9990 9.2388 3.5035 11.5614 20.5473 10.9519 1.1451 32.5385 0.1185 3.7295 0.3421 65.9947 33.3617 238.9756 14.4500 42.8519 10.3869 17.6619 2.8199 11.6354 7.5201 1.5598 0.3442 21.0984 1.9911 130.4770 320.5447 44.0456 22.7819 5.9988 19.9518 8.4018 41.4287 24.9710 2.9016 29.0234 19.4537 17.1196 1.6579 5.0087 5.9080 21.0796
temp: 298.150 k
press: 1.00000 atm
elementType: 35 8 8 7 6 6 6 6 6 6 6 6 6 6 6 6 6 1 1 1 1 1 1 1 1 1 1 1 1 1 1
symmnumber: 1
zpe: 639477.1 jmol-1
zpe.correction: 0.243564 hartree
zpe.thermalcorrener: 0.260008 hartree
zpe.thermalcorrenthalpy: 0.260952 hartree
zpe.thermalcorrgfe: 0.195293 hartree
zpe.sumelectzpe: -721.239001 hartree
zpe.sumelectthermal: -721.222557 hartree
zpe.sumelectthermalent: -721.221612 hartree
zpe.sumelectthermalfe: -721.287272 hartree
dipole: -4.3948 0.0609 0.2025
dipole: 4.3999
quadrupole: -101.2163 -118.9233 -107.7055
quadrupole: 4.9170 16.1429 2.1147
quadrupole: 8.0654 -9.6416 1.5762 4.9170 16.1429 2.1147
hfenergy: -721.4825647 hartree
pointgroup: C01 [X(C13H14Br1N1O2)]
dipole: -1.7157126 0.037823 0.2268226 debye
polarizability: 238.0720649|-2.9622794|158.7189795|11.2059939|4.2215584|110.1903698 unknown
InChI: InChI=1S/C13H14BrNO2/c14-8-4-1-5-9-15-12(16)10-6-2-3-7-11(10)13(15)17/h2-3,6-7H,1,4-5,8-9H2
charge 0 multiplicity 1
31 atoms
Br 7.416998 -0.177868 -1.437051
O  -0.725752 2.413495 0.650334
O  -0.543843 -2.291242 0.558431
N  -0.310572 0.070815 0.721893
C  2.112699 0.014001 0.074159
C  1.073568 0.112967 1.21469
C  3.557492 0.063082 0.619716
C  4.607363 -0.062833 -0.514791
C  -2.419024 0.713884 -0.033434
C  -2.363979 -0.701444 -0.062663
C  -1.103475 1.229465 0.467525
C  -1.011959 -1.133337 0.420499
C  6.029919 -0.008744 0.045209
C  -3.570503 1.409994 -0.429172
C  -3.458276 -1.46755 -0.489959
C  -4.683862 0.643862 -0.864068
C  -4.628393 -0.772651 -0.894479
H  1.952184 0.846907 -0.637192
H  1.95388 -0.931047 -0.47921
H  1.194761 1.064981 1.762348
H  1.205531 -0.72726 1.920803
H  3.713444 1.014238 1.169199
H  3.702589 -0.757249 1.352745
H  4.465063 0.753132 -1.248242
H  4.456533 -1.015234 -1.056832
H  6.261441 0.952372 0.530621
H  6.251882 -0.844797 0.726922
H  -3.601985 2.503615 -0.400248
H  -3.404601 -2.560547 -0.50781
H  -5.600562 1.152274 -1.181385
H  -5.502958 -1.33698 -1.23536
