program: Gaussian 09
title: 000136733
version: EM64L-G09RevD.01
frameworkgroup: C1[X(C3F6)]
method: RPBEPBE
basis: SDD
operation: Freq
keyword: #p
keyword: freq=noraman
keyword: PBEPBE/SDD
title: #p freq=noraman PBEPBE/SDD
converged: NO NO NO NO
title: Mulliken charges:
elementType: F F F F F F C C C
charge: -0.133345 -0.133353 -0.133360 -0.133271 -0.133337 -0.133304 0.266731 0.266623 0.266616
chargesum: 0.00000
title: Mulliken charges with hydrogens summed into heavy atoms:
polarizability: 3.23062722e+01 1.17213756e-03 3.22938703e+01 2.20136419e-03 -9.18854752e-04 3.70052166e+01
1716.lowfreq: -3.3946 -0.0013 -0.0012 -0.0008 8.8977 13.5982 131.8148 132.9737 182.3365
frequency: 131.8112 132.9731 182.3358 219.1425 230.7529 231.0728 324.4166 454.5651 454.6009 477.5623 477.7255 649.0633 738.4669 812.0858 812.3743 1109.1524 1109.4718 1125.1556 1136.8522 1137.1689 1419.3830
redmass: 18.9588 18.9586 18.1059 18.9984 18.4008 18.4017 18.8758 17.3665 17.3676 16.8702 16.8727 18.2877 12.3753 13.8002 13.7973 13.0008 13.0006 13.6292 12.7417 12.7409 12.3539
irintensity: 0.0000 0.0003 8.6279 0.0000 1.0158 1.0124 0.0000 0.0000 0.0000 17.1096 17.0221 0.0000 0.0033 130.0186 130.1431 0.0850 0.0075 449.5557 65.3434 65.2569 0.0000
temp: 298.150 k
press: 1.00000 atm
elementType: 9 9 9 9 9 9 6 6 6
symmnumber: 1
zpe: 79947.2 jmol-1
zpe.correction: 0.030450 hartree
zpe.thermalcorrener: 0.038676 hartree
zpe.thermalcorrenthalpy: 0.039620 hartree
zpe.thermalcorrgfe: -0.002811 hartree
zpe.sumelectzpe: -712.584807 hartree
zpe.sumelectthermal: -712.576581 hartree
zpe.sumelectthermalent: -712.575637 hartree
zpe.sumelectthermalfe: -712.618068 hartree
dipole: 0.0008 -0.0008 -0.0005
dipole: 0.0013
quadrupole: -48.8729 -48.8704 -51.1074
quadrupole: 0.0000 -0.0020 0.0011
quadrupole: 0.7440 0.7465 -1.4905 0.0000 -0.0020 0.0011
hfenergy: -712.6152571 hartree
pointgroup: C01 [X(C3F6)]
dipole: 0.0000012 0.0004638 -0.0001928 debye
dipolederiv: -0.5306116 0.0399153 -0.243208 0.0399299 -0.2301821 0.0315819 -0.3105809 0.0404305 -0.585161 -0.5297152 0.0404655 0.243012 0.0406445 -0.2303593 -0.032556 0.3103739 -0.0413662 -0.58586 -0.2704435 0.1098075 0.0935877 0.1097902 -0.4902758 -0.2266099 0.1195923 -0.2894487 -0.5852052 -0.2708088 0.1101783 -0.0944114 0.1100083 -0.4894064 0.2264148 -0.1203927 0.2892152 -0.5859119 -0.3399618 -0.1503232 -0.1490972 -0.1502163 -0.4209006 -0.1946811 -0.1902917 -0.2485503 -0.5847755 -0.339563 -0.1496923 0.1491922 -0.1495705 -0.419907 0.194504 0.1903585 0.2483989 -0.5862244 0.905892 -0.0389783 0.0002622 -0.039278 0.6148166 0.0007586 0.0002652 0.0007176 1.1710942 0.654312 -0.1068889 0.0006075 -0.1067566 0.8670517 0.0002516 0.0005798 0.000279 1.1711036 0.7208999 0.1455161 0.0000548 0.1454484 0.7991629 0.0003362 0.0000956 0.0003239 1.1709402 unknown
polarizability: 32.3013457|-0.0061768|32.2988046|0.0032845|0.0056675|37.0052087 unknown
InChI: InChI=1S/C3F6/c4-1(5)2(6,7)3(1,8)9
charge 0 multiplicity 1
9 atoms
F  1.66876 -0.217867 1.149539
F  1.666948 -0.22071 -1.151646
F  -0.643445 1.554972 1.149514
F  -0.645434 1.552867 -1.15169
F  -1.024136 -1.336117 -1.148348
F  -1.02272 -1.333483 1.152738
C  0.888953 -0.116588 -0.000566
C  -0.343366 0.828288 -0.000742
C  -0.545458 -0.711262 0.001202
