program: Gaussian 09
title: 000136732
version: EM64L-G09RevD.01
frameworkgroup: C1[X(C7H13Cl)]
method: RPBEPBE
basis: SDD
operation: Freq
keyword: #pfreq=noraman
keyword: PBEPBE/SDD
title: #p freq=noraman PBEPBE/SDD
converged: NO YES NO NO
title: Mulliken charges:
elementType: Cl C C C C C C C H H H H H H H H H H H H H
charge: -0.125845 0.042566 -0.405157 -0.405156 -0.390075 -0.390074 -0.385657 -0.688138 0.230342 0.190118 0.190118 0.230342 0.221028 0.196650 0.196650 0.221028 0.184011 0.207675 0.237604 0.237604 0.204365
chargesum: 0.00000
title: Mulliken charges with hydrogens summed into heavy atoms:
elementType: Cl C C C C C C C
charge: -0.125845 0.042566 0.015304 0.015303 0.027603 0.027604 0.006030 -0.008565
polarizability: 8.49299197e+01 -1.46227512e+00 8.34088105e+01 -1.54414433e-05 -1.38229387e-06 7.49948278e+01
1716.lowfreq: -9.7725 -5.8702 0.0016 0.0023 0.0026 18.8624 123.8335 183.4799 223.4613
frequency: 123.7860 183.4202 223.4598 252.6170 269.8102 315.8570 363.3634 370.7522 432.0727 455.3835 488.2230 553.1904 753.0146 770.9757 844.8381 848.9406 878.4298 915.9205 959.2913 988.9305 1010.4468 1051.4837 1089.9882 1102.9419 1136.4163 1146.5468 1147.8163 1246.3792 1248.0184 1276.0041 1278.4586 1322.9974 1340.1634 1343.1860 1343.4878 1363.5671 1389.0983 1439.7564 1450.5999 1460.7532 1464.8321 1467.4327 1470.7852 1477.3229 2951.5529 2957.5673 2962.8761 2978.3889 2989.7550 2990.4055 3032.7108 3042.0832 3046.3499 3050.0004 3057.0040 3074.5865 3102.3756
redmass: 3.4984 2.9072 1.0186 3.0416 2.0636 2.4895 2.3707 2.1037 3.0764 3.2630 2.8047 1.9162 2.8652 1.4939 2.6665 1.4330 2.1708 1.3808 2.1206 1.5292 1.4964 1.9915 1.2803 1.2554 2.5356 1.7425 2.3733 1.6684 1.3202 1.2728 1.4745 1.4627 1.3745 1.4920 1.5874 1.5603 1.2099 1.0836 1.0869 1.0576 1.0833 1.0739 1.0599 1.0892 1.0656 1.0652 1.0640 1.0393 1.0631 1.0603 1.0955 1.0946 1.0947 1.1020 1.1025 1.0951 1.1006
irintensity: 0.7903 1.4344 0.1756 1.5202 0.0042 3.5230 0.0419 4.7668 1.3994 0.3208 22.0582 5.7533 12.4387 0.4477 4.3056 10.2144 2.1118 8.8405 16.4617 2.7270 3.3572 1.0732 0.8665 2.5413 13.1086 2.0542 17.5387 8.8197 14.8148 2.9014 0.5093 2.0014 0.0044 0.6149 1.8859 8.6218 15.7552 2.7844 9.1624 16.2043 6.7980 1.9010 23.0177 9.1219 5.5059 35.5112 42.1130 37.3977 13.5220 51.8652 62.5352 62.8708 1.2606 0.3192 66.6618 34.5017 22.5911
temp: 298.150 k
press: 1.00000 atm
elementType: 17 6 6 6 6 6 6 6 1 1 1 1 1 1 1 1 1 1 1 1 1
symmnumber: 1
zpe: 486260.5 jmol-1
zpe.correction: 0.185207 hartree
zpe.thermalcorrener: 0.193659 hartree
zpe.thermalcorrenthalpy: 0.194603 hartree
zpe.thermalcorrgfe: 0.152579 hartree
zpe.sumelectzpe: -733.963172 hartree
zpe.sumelectthermal: -733.954720 hartree
zpe.sumelectthermalent: -733.953776 hartree
zpe.sumelectthermalfe: -733.995800 hartree
dipole: -1.1782 2.3596 0.0000
dipole: 2.6374
quadrupole: -58.4080 -57.9682 -56.1974
quadrupole: 2.9535 0.0000 0.0000
quadrupole: -0.8835 -0.4437 1.3271 2.9535 0.0000 0.0000
hfenergy: -734.1483791 hartree
pointgroup: C01 [X(C7H13Cl1)]
dipole: -0.3105087 -0.0000906 -0.9900856 debye
dipolederiv: -0.3219745 -0.0000105 -0.1101263 -0.0000098 -0.2687502 -0.0000422 -0.1045917 -0.0000421 -0.7428368 0.3522025 0.0000126 0.132082 0.0000175 0.3017609 0.0000533 0.2141336 0.0000538 0.8967464 -0.0363735 -0.027106 0.0323303 -0.0213686 -0.0213691 0.0059043 -0.0296618 -0.0005599 -0.0069856 -0.0363776 0.0271107 0.0323268 0.0213635 -0.0213649 -0.0059008 -0.0296638 0.0005631 -0.0069855 0.056697 0.0174003 0.0355238 -0.0093852 0.0577347 0.0256013 -0.0089208 -0.0047647 0.1001039 0.0566957 -0.0173933 0.0355285 0.0093839 0.0577333 -0.0255924 -0.0089217 0.0047711 0.1001061 0.061574 0.0000017 -0.0040404 0.0000061 0.0311513 0.0000121 0.0340307 0.0000131 0.1735738 -0.1528741 -0.0000028 0.0226772 -0.0000003 0.0138821 -0.0000049 0.0390783 -0.0000049 -0.0536916 -0.0375855 0.1173767 -0.0199727 0.0946755 -0.0848742 0.0184503 -0.0207495 0.0569418 0.0833685 0.0434803 -0.0347166 -0.0398795 -0.0380355 0.0679903 -0.0099833 0.0101634 -0.0228283 -0.1776386 0.0434781 0.0347086 -0.0398876 0.0380363 0.0679977 0.0099384 0.010154 0.0227854 -0.1776434 -0.0375759 -0.1173766 -0.0199514 -0.0946768 -0.0848964 -0.0184215 -0.0207309 -0.0569134 0.0833814 0.0575672 0.0378804 -0.0333119 0.0429449 0.0752051 -0.0096162 0.015363 0.0448689 -0.1299716 -0.0385112 -0.1127187 -0.0179503 -0.1120924 -0.1540113 -0.042797 -0.0356091 -0.0712246 0.069781 -0.0385185 0.1127188 -0.0179706 0.1120911 -0.1539858 0.0428334 -0.0356303 0.0712603 0.0697622 0.0575711 -0.0378872 -0.033307 -0.0429431 0.0751956 0.0095804 0.0153708 -0.0449026 -0.129965 0.0751507 0.0000002 -0.008582 -0.0000073 0.0167846 -0.0000185 -0.0943238 -0.00002 -0.1978415 -0.2002805 0.0000007 0.0803921 0.0000028 0.0441989 0.0000015 0.1218764 0.000002 0.0377003 0.015314 -0.0776485 0.0066221 -0.1300117 -0.0616165 -0.0282731 -0.0284166 -0.050266 0.0877385 0.0153057 0.0776528 0.0066089 0.1300107 -0.0615976 0.0282966 -0.0284383 0.0502883 0.0877258 0.0650351 -0.0000034 -0.039112 -0.0000016 0.1028316 -0.0000218 -0.0145121 -0.0000212 -0.1664283 unknown
polarizability: 84.4339223|0.0003023|74.9948279|1.6268686|0.0007928|83.9048078 unknown
InChI: InChI=1S/C7H13Cl/c1-7(8)5-3-2-4-6-7/h2-6H2,1H3
charge 0 multiplicity 1
21 atoms
Cl 1.310193 0.000162 1.736115
C  0.900287 -0.000008 -0.182863
C  0.086437 -1.281326 -0.455874
C  0.086387 1.281232 -0.456093
C  -1.317247 -1.273966 0.190552
C  -1.317299 1.273927 0.19034
C  -2.106804 -0.000065 -0.191449
C  2.267302 -0.000039 -0.876226
H  0.667494 -2.162623 -0.127919
H  -0.020403 -1.355894 -1.560495
H  -0.020465 1.3556 -1.560726
H  0.667406 2.162611 -0.128291
H  -1.205083 -1.322863 1.290623
H  -1.869826 -2.180437 -0.122866
H  -1.869908 2.180328 -0.123228
H  -1.205131 1.323013 1.290402
H  -2.302562 -0.000162 -1.284596
H  -3.093146 -0.000048 0.310592
H  2.851542 0.894684 -0.60193
H  2.851574 -0.894698 -0.601793
H  2.125552 -0.000126 -1.975175
