program: Gaussian 09
title: 000136726
version: EM64L-G09RevD.01
frameworkgroup: C1[X(C6H10O)]
method: RPBEPBE
basis: SDD
operation: Freq
keyword: #pfreq=noraman
keyword: PBEPBE/SDD
title: #p freq=noraman PBEPBE/SDD
converged: YES YES NO NO
title: Mulliken charges:
elementType: O C C C C C C H H H H H H H H H H
charge: -0.239283 -0.101869 -0.296694 -0.506936 -0.708911 0.238244 -0.774991 0.272742 0.232357 0.268939 0.234336 0.226090 0.208765 0.223630 0.234595 0.235250 0.253736
chargesum: 0.00000
title: Mulliken charges with hydrogens summed into heavy atoms:
elementType: O C C C C C C
charge: -0.239283 0.170874 -0.064337 -0.003662 -0.050425 0.238244 -0.051410
polarizability: 8.02675331e+01 2.04147722e+00 6.26431645e+01 6.72493383e-01 -1.73893082e+00 5.63257553e+01
1716.lowfreq: -23.9908 -13.2273 -6.2100 -0.0008 -0.0008 -0.0007 63.9319 116.9322 158.3789
frequency: 63.5997 116.9168 158.3720 173.9852 205.4483 314.1850 363.7478 388.0165 572.5501 582.2092 740.8143 765.7533 848.6193 875.5055 931.9136 941.4328 992.3796 1028.0826 1049.4714 1076.1342 1083.2125 1122.3642 1172.0788 1188.0830 1212.7331 1321.5753 1364.6908 1390.7223 1403.4927 1438.1471 1445.8296 1454.9964 1469.5722 1477.2750 1613.3248 2975.7024 2978.9176 3062.2050 3067.9325 3072.0471 3094.9073 3120.8703 3124.4326 3132.8162 3208.1137
redmass: 3.1538 1.0366 2.9197 1.5901 1.7013 3.2767 2.7229 2.2139 3.8029 2.5763 3.4258 2.0470 3.0410 1.2389 1.2605 2.1907 1.9768 1.7359 1.4081 1.0985 1.5651 1.4765 1.6399 1.9751 1.6439 1.7057 1.2505 1.2545 1.7869 1.3295 1.1726 1.0502 1.0487 1.0717 7.1338 1.0356 1.0371 1.0965 1.0987 1.0991 1.0554 1.0911 1.0995 1.0908 1.1164
irintensity: 4.4460 0.1918 0.6177 1.8290 1.7808 3.3170 1.5712 0.8895 5.2640 1.0278 2.8322 1.7524 32.5238 3.1590 14.6195 11.0599 8.9215 9.8392 18.3625 8.7722 35.3937 1.9025 13.7594 73.3976 3.2325 54.7614 52.2103 17.2846 77.4234 40.0128 14.4015 19.8913 6.7625 14.1946 107.6099 34.5735 4.3024 12.6865 26.0386 28.1531 15.4032 8.2409 13.9913 17.0716 6.4542
temp: 298.150 k
press: 1.00000 atm
elementType: 8 6 6 6 6 6 6 1 1 1 1 1 1 1 1 1 1
symmnumber: 1
zpe: 377931.3 jmol-1
zpe.correction: 0.143946 hartree
zpe.thermalcorrener: 0.152190 hartree
zpe.thermalcorrenthalpy: 0.153134 hartree
zpe.thermalcorrgfe: 0.111245 hartree
zpe.sumelectzpe: -309.273759 hartree
zpe.sumelectthermal: -309.265515 hartree
zpe.sumelectthermalent: -309.264571 hartree
zpe.sumelectthermalfe: -309.306460 hartree
dipole: 1.4460 -2.5734 1.4522
dipole: 3.2897
quadrupole: -42.1478 -44.7011 -43.0529
quadrupole: 4.1371 -2.1050 1.6066
quadrupole: 1.1528 -1.4005 0.2477 4.1371 -2.1050 1.6066
hfenergy: -309.4177051 hartree
pointgroup: C01 [X(C6H10O1)]
dipole: -0.5851972 1.0173324 0.5456682 debye
dipolederiv: -0.6873625 0.023127 0.0795175 0.2253547 -0.7177763 -0.2247988 0.200292 -0.1952005 -0.4621579 0.3474605 -0.0329115 -0.0194247 0.291318 0.1287179 -0.0387469 -0.0667337 -0.0464118 0.0387224 -1.0961638 -0.1126125 0.1103421 -0.2850277 -0.0565066 0.0530966 0.0257769 0.0321404 -0.0271146 0.1553489 0.0061354 -0.0904695 0.0635545 -0.034396 0.0609599 0.165695 0.1263204 -0.0503293 -0.0403866 0.0627572 0.0085291 -0.0448078 0.0553404 -0.0091642 -0.0416127 0.0047428 0.0685876 1.4695161 0.1918746 -0.1970383 -0.0583337 0.736045 0.3092143 -0.3980097 0.2687948 0.3029273 -0.2772974 -0.2478338 -0.0432209 -0.3110433 -0.2626769 -0.0883471 -0.0561379 -0.0993776 0.0305495 0.0129542 0.0679259 0.0272019 0.0242253 0.0460373 -0.062234 -0.0174625 -0.0481177 -0.0368524 0.0191377 -0.0105394 0.0234033 -0.0151016 -0.0805735 -0.0879992 0.0231216 -0.0793483 0.064907 0.0537699 0.0863453 0.0102583 0.0205369 -0.0341743 0.0515297 0.0152796 0.0039285 0.0771817 0.0002144 0.0072323 0.1267215 -0.012992 0.069045 -0.0211306 0.0905972 0.0105278 -0.0238497 -0.14847 -0.0707836 -0.0678726 -0.0884491 0.013647 -0.0258409 -0.0541222 -0.0218182 0.0910101 0.0771609 0.0133718 -0.0072692 0.0469648 0.0297621 -0.0743647 0.0624609 -0.1214075 -0.1016307 0.0626709 -0.0203131 0.0220406 0.0404136 -0.0407493 0.14519 -0.0063259 0.1354244 -0.040582 0.0520953 0.0626878 -0.0576117 0.0410588 -0.0402394 0.0669996 -0.0130101 0.0939135 0.0822947 0.0848649 -0.035851 0.0205768 -0.0005296 0.1105387 -0.0166224 -0.0150515 -0.0399794 -0.100511 -0.0855135 0.0093877 0.0543158 0.0628581 0.0779587 -0.0377412 0.0852431 -0.0241317 0.0868473 unknown
polarizability: 80.252945|2.1351314|62.729174|-0.3394575|1.6641188|56.2543339 unknown
InChI: InChI=1S/C6H10O/c1-4-3-6(4)5(2)7/h4,6H,3H2,1-2H3
charge 0 multiplicity 1
17 atoms
O  1.471948 -1.103639 -0.653017
C  -1.358159 -0.176544 -0.355637
C  -0.125176 0.319167 0.461221
C  -1.019128 -0.856395 0.954297
C  -2.578999 0.721233 -0.48503
C  1.23857 -0.012739 -0.053775
C  2.330701 1.025754 0.175204
H  -1.074346 -0.737031 -1.254549
H  -0.230532 1.279255 0.977459
H  -0.551777 -1.844429 0.913605
H  -1.651104 -0.661194 1.826242
H  -3.475672 0.122378 -0.731006
H  -2.783857 1.259597 0.458907
H  -2.442123 1.472735 -1.284045
H  2.05086 1.987572 -0.29562
H  2.453521 1.219829 1.257892
H  3.284673 0.67385 -0.245948
