program: Gaussian 09
title: 000136709
version: EM64L-G09RevD.01
frameworkgroup: C1[X(C6H8)]
method: RPBEPBE
basis: SDD
operation: Freq
keyword: #p
keyword: freq=noraman
keyword: PBEPBE/SDD
title: #p freq=noraman PBEPBE/SDD
converged: NO YES NO NO
title: Mulliken charges:
elementType: C C C C C C H H H H H H H H
charge: 0.362854 -0.780450 -0.065782 -0.678974 -0.741041 0.017613 0.221506 0.232790 0.232874 0.216883 0.233250 0.250321 0.248846 0.249310
chargesum: 0.00000
title: Mulliken charges with hydrogens summed into heavy atoms:
elementType: C C C C C C
charge: 0.362854 -0.093280 -0.065782 -0.228842 0.007437 0.017613
polarizability: 1.04424534e+02 1.13486560e+01 6.01324084e+01 -2.19849813e-01 -6.64185811e-02 3.74971839e+01
1716.lowfreq: -12.3558 0.0003 0.0007 0.0010 5.4013 7.1069 39.9800 106.7127 145.3031
frequency: 38.7808 106.7125 145.2972 178.7344 293.8444 344.8126 368.5792 530.6478 539.1171 644.1394 719.2289 919.4611 947.4452 1005.7631 1027.1809 1032.1267 1049.7707 1080.0388 1307.1080 1390.5379 1400.5704 1421.4501 1458.3374 1460.6343 1461.1430 1476.0392 1629.2258 2258.7898 2971.0041 2978.5837 3056.3434 3061.2188 3062.3340 3093.5229 3101.9296 3211.8929
redmass: 1.0448 3.1029 1.9267 1.3393 3.5784 4.1831 2.4550 2.4685 5.1060 3.3837 1.2032 2.3565 1.3316 1.3654 1.3843 1.3873 1.4845 2.4775 4.2716 1.2146 1.2266 1.2402 1.0460 1.0413 1.0421 1.0589 4.5062 11.7589 1.0349 1.0357 1.0980 1.0979 1.0986 1.1000 1.0618 1.1153
irintensity: 0.0217 3.8825 5.1520 5.7224 6.3340 0.3130 0.5580 5.2494 2.7367 0.8359 0.1060 0.1863 79.0646 3.3758 7.3015 2.9991 6.4136 3.8875 25.2576 17.2582 0.3095 0.4052 16.7509 13.2227 12.4200 18.8582 32.3423 14.4252 39.0800 23.1283 14.0981 21.6252 14.8615 26.7078 3.1811 17.7356
temp: 298.150 k
press: 1.00000 atm
elementType: 6 6 6 6 6 6 1 1 1 1 1 1 1 1
symmnumber: 1
zpe: 303686.1 jmol-1
zpe.correction: 0.115668 hartree
zpe.thermalcorrener: 0.123418 hartree
zpe.thermalcorrenthalpy: 0.124362 hartree
zpe.thermalcorrgfe: 0.083396 hartree
zpe.sumelectzpe: -232.908972 hartree
zpe.sumelectthermal: -232.901222 hartree
zpe.sumelectthermalent: -232.900278 hartree
zpe.sumelectthermalfe: -232.941244 hartree
dipole: -0.7661 -0.5196 0.0080
dipole: 0.9257
quadrupole: -27.9376 -35.5876 -38.9179
quadrupole: -0.3648 -0.0165 -0.0006
quadrupole: 6.2101 -1.4399 -4.7702 -0.3648 -0.0165 -0.0006
hfenergy: -233.0246404 hartree
pointgroup: C01 [X(C6H8)]
dipole: 0.2994499 -0.2072638 -0.0029616 debye
dipolederiv: 0.5916463 0.0026579 -0.0019632 0.0295983 0.3841301 -0.0026832 0.000895 0.0009732 -0.0024864 -0.0495543 -0.0428791 -0.0020882 -0.0289924 -0.1089415 0.0008666 -0.0000902 -0.0000058 0.0848453 -0.3619813 -0.0143312 0.0047546 -0.1060354 -0.1787363 0.002964 -0.0006993 0.0000737 -0.0822074 -0.1898273 0.1317865 0.0011453 0.1397357 -0.1850494 -0.0010419 -0.0001235 0.0002641 -0.4332783 0.0265607 0.0086498 0.000311 -0.0080946 0.1274565 0.0010825 0.051897 -0.0207522 0.0986143 0.1582062 -0.0225604 -0.003842 -0.0106809 -0.1766803 -0.0005133 -0.0215341 0.0092289 -0.164874 -0.1785575 -0.0244352 -0.0007092 0.0381332 0.0585729 -0.0005846 -0.0002432 0.0005089 0.1118243 0.0898999 0.0107513 -0.0764173 0.0129149 -0.0043229 0.0862546 -0.034383 0.1249869 -0.0435563 0.0896639 0.0111632 0.0769728 0.0130148 -0.0041667 -0.0857337 0.0345618 -0.1248033 -0.0429543 -0.1317644 -0.0019845 -0.0006854 -0.0175277 0.0798428 0.0002882 -0.0002656 -0.001825 0.1872305 0.0415691 -0.0833821 0.0003751 -0.0790075 -0.0625006 0.0000541 0.0000672 0.0008473 0.20428 -0.0336067 -0.0423186 -0.0386685 -0.0838104 -0.007462 -0.0932633 -0.0811642 -0.0849963 0.0670679 -0.0118105 0.0496772 -0.0212548 0.0956443 -0.0476887 0.0826144 -0.0566662 0.0881015 0.0895428 -0.040444 0.0172052 0.0620697 0.0051077 0.1255463 0.0096956 0.1077484 0.007398 -0.0740485 unknown
polarizability: 104.2069945|-11.7637803|60.3500973|-0.2006994|0.0500881|37.4970349 unknown
InChI: InChI=1S/C6H8/c1-4-5-6(2)3/h2H2,1,3H3
charge 0 multiplicity 1
14 atoms
C  -1.151729 0.106324 0.000325
C  -1.844934 -1.251215 0.000689
C  0.289165 0.085029 0.001375
C  -1.853845 1.279725 -0.001215
C  2.99198 -0.085612 0.000682
C  1.52436 -0.004722 0.00158
H  -2.942325 -1.136764 -0.000211
H  -1.552586 -1.839855 0.890292
H  -1.551198 -1.840961 -0.887718
H  -2.949677 1.283122 -0.002116
H  -1.346015 2.249731 -0.001657
H  3.438617 0.747494 0.574504
H  3.341146 -1.033296 0.450926
H  3.39324 -0.0352 -1.029155
