program: Gaussian 09
title: 000136705
version: EM64L-G09RevD.01
frameworkgroup: C1[X(C4H2N2)]
method: RPBEPBE
basis: SDD
operation: Freq
keyword: #p
keyword: freq=noraman
keyword: PBEPBE/SDD
title: #p freq=noraman PBEPBE/SDD
converged: NO YES NO YES
title: Mulliken charges:
elementType: N N C C C C H H
charge: 0.021460 0.021450 0.406147 -0.566314 -0.206164 -0.206133 0.264779 0.264775
chargesum: 0.00000
title: Mulliken charges with hydrogens summed into heavy atoms:
elementType: N N C C C C
charge: 0.021460 0.021450 0.406147 -0.036760 -0.206164 -0.206133
polarizability: 6.48909692e+01 4.74084402e-03 6.17539916e+01 2.80257434e-03 6.59158949e-03 2.17095072e+01
1716.lowfreq: -9.8524 0.0008 0.0009 0.0009 5.1017 7.9381 139.4105 233.5988 248.7264
frequency: 139.4105 233.5964 248.7263 371.5098 497.1606 588.4706 658.3611 727.4059 732.5433 942.8208 1007.3929 1252.4006 1418.3992 1594.9402 2186.8873 2190.9289 3124.1431 3242.8792
redmass: 11.4362 7.0608 4.0359 4.6542 5.1606 12.3693 7.8471 1.1776 7.2186 1.7560 1.3683 3.9867 1.2620 4.2033 12.6216 12.6389 1.0617 1.1181
irintensity: 5.4447 1.3716 0.0024 0.0000 0.2383 0.0434 1.2475 0.0001 4.2891 0.1297 69.1454 26.3352 10.9370 7.0608 0.0170 0.5271 1.0469 0.2863
temp: 298.150 k
press: 1.00000 atm
elementType: 7 7 6 6 6 6 1 1
symmnumber: 1
zpe: 126552.8 jmol-1
zpe.correction: 0.048201 hartree
zpe.thermalcorrener: 0.053864 hartree
zpe.thermalcorrenthalpy: 0.054808 hartree
zpe.thermalcorrgfe: 0.018983 hartree
zpe.sumelectzpe: -262.652267 hartree
zpe.sumelectthermal: -262.646604 hartree
zpe.sumelectthermalent: -262.645660 hartree
zpe.sumelectthermalfe: -262.681485 hartree
dipole: 0.0005 4.2534 0.0010
dipole: 4.2534
quadrupole: -45.8107 -31.0331 -34.2583
quadrupole: 0.0009 -0.0008 -0.0010
quadrupole: -8.7767 6.0010 2.7757 0.0009 -0.0008 -0.0010
hfenergy: -262.7004682 hartree
pointgroup: C01 [X(C4H2N2)]
dipole: 0.0000989 1.6734102 -0.0004038 debye
dipolederiv: -0.1478 -0.0188533 0.0001897 -0.0236163 -0.1624402 -0.0001233 0.0000836 -0.0000985 -0.2118534 -0.1475484 0.0186229 0.0000103 0.0236423 -0.1626608 0.0000007 0.0000047 0.0000134 -0.2118486 0.490627 0.0000337 -0.0000369 -0.0001004 0.1742621 -0.0000146 0.0000019 -0.000168 0.206232 -0.0679805 -0.0000222 -0.0000409 -0.0000047 0.0028288 0.0000516 0.0000097 0.0000921 -0.2494938 -0.0728813 -0.060975 -0.0001398 -0.0915961 -0.0285891 0.0001133 -0.000131 0.0002169 0.0485872 -0.07319 0.0611884 -0.0000244 0.0916926 -0.0283022 -0.0000094 0.0000071 -0.0000173 0.0485985 0.0093725 0.0330256 0.0000237 0.0482377 0.1024476 -0.0000093 0.0000181 -0.0000109 0.184885 0.0094007 -0.0330202 0.0000184 -0.0482553 0.1024537 -0.0000089 0.000006 -0.0000277 0.1848931 unknown
polarizability: 64.8909674|-0.0052888|61.7539934|0.0028014|-0.0065921|21.7095072 unknown
InChI: InChI=1S/C4H2N2/c1-4(2-5)3-6/h1H2
charge 0 multiplicity 1
8 atoms
N  2.247631 -0.916465 0.000337
N  -2.247761 -0.915807 0.000148
C  0.000138 0.469675 -0.000378
C  0.000063 1.838976 -0.000345
C  1.230471 -0.288876 -0.000296
C  -1.230101 -0.28903 0.0000
H  -0.939421 2.399609 -0.000197
H  0.939481 2.399718 -0.000369
