program: Gaussian 09
title: 000136703
version: EM64L-G09RevD.01
frameworkgroup: C1[X(C5H6O3)]
method: RPBEPBE
basis: SDD
operation: Freq
keyword: #p
keyword: freq=noraman
keyword: PBEPBE/SDD
title: #p freq=noraman PBEPBE/SDD
converged: YES YES NO NO
title: Mulliken charges:
elementType: O O O C C C C C H H H H H H
charge: -0.163464 -0.164999 -0.165283 0.049251 0.182785 0.183192 -0.744937 -0.744789 0.260377 0.254611 0.269210 0.260417 0.269093 0.254534
chargesum: 0.00000
title: Mulliken charges with hydrogens summed into heavy atoms:
elementType: O O O C C C C C
charge: -0.163464 -0.164999 -0.165283 0.049251 0.182785 0.183192 0.039262 0.039256
polarizability: 6.75672768e+01 2.94106946e-03 6.45165590e+01 3.01361015e+00 -9.94875121e-03 4.77185929e+01
1716.lowfreq: -7.2560 -6.2864 -1.5696 0.0002 0.0006 0.0007 32.5272 62.8615 116.3975
frequency: 32.5248 62.8583 116.3932 119.3091 150.3378 187.0174 291.5747 296.0451 405.1628 449.1797 531.5718 600.6251 641.2485 703.6155 869.3628 944.2057 1006.3736 1015.7737 1035.0010 1189.7165 1262.5971 1371.2110 1371.9079 1437.0796 1437.3393 1438.7451 1439.6676 1589.0664 1606.5783 1627.0375 2985.2263 2985.5423 3070.5239 3070.8550 3130.0810 3130.2618
redmass: 4.4457 4.1695 1.0477 1.0501 8.4057 5.6418 3.1069 5.7742 5.1748 4.7332 3.4836 3.6644 3.6823 3.5457 3.9651 1.8906 1.8010 1.8428 2.0437 3.2797 5.2437 1.2554 1.2759 1.0535 1.0570 1.0797 1.0725 11.1511 8.6434 9.5777 1.0382 1.0382 1.0934 1.0932 1.1014 1.1013
irintensity: 10.0236 5.4148 0.6068 0.2738 0.4808 23.4246 1.6157 11.9896 0.7379 30.5189 31.6706 0.0462 0.1731 2.7644 45.0458 0.0044 2.5104 18.7842 31.8966 4.7431 36.5903 19.1078 125.8441 19.2710 39.3349 39.4359 9.3896 41.1850 90.1952 98.8030 0.3119 0.2559 3.9661 2.3630 7.5470 3.8900
temp: 298.150 k
press: 1.00000 atm
elementType: 8 8 8 6 6 6 6 6 1 1 1 1 1 1
symmnumber: 1
zpe: 260795.6 jmol-1
zpe.correction: 0.099332 hartree
zpe.thermalcorrener: 0.108798 hartree
zpe.thermalcorrenthalpy: 0.109742 hartree
zpe.thermalcorrgfe: 0.063745 hartree
zpe.sumelectzpe: -419.161635 hartree
zpe.sumelectthermal: -419.152169 hartree
zpe.sumelectthermalent: -419.151225 hartree
zpe.sumelectthermalfe: -419.197222 hartree
dipole: -0.0026 1.8930 -0.0033
dipole: 1.8930
quadrupole: -36.7135 -56.2381 -47.2690
quadrupole: -0.0011 5.3236 -0.0008
quadrupole: 10.0267 -9.4979 -0.5288 -0.0011 5.3236 -0.0008
hfenergy: -419.2609671 hartree
pointgroup: C01 [X(C5H6O3)]
dipole: 0.1439021 0.1146119 -0.7216941 debye
dipolederiv: -0.5694827 -0.0293573 0.0259717 -0.1420844 -0.2960068 0.0406157 0.008587 0.0628754 -0.7124579 -0.5301197 -0.0936199 -0.1400948 -0.1506647 -0.570681 0.1416312 -0.0464359 0.2189849 -0.4914698 -0.5847574 -0.0386297 0.1047497 -0.0901389 -0.4425909 -0.1850953 -0.0061806 -0.2402384 -0.5652086 0.5520197 0.0007806 -0.037804 0.1378406 0.1420338 -0.068746 -0.0168688 -0.0962694 0.7227895 0.7113918 0.3592665 0.1493265 0.3414027 0.7173923 -0.1342204 0.077103 -0.2723865 0.3621816 0.7101991 0.2222026 0.0594076 0.2388224 0.52388 0.3134707 0.1316575 0.4522403 0.555558 -0.313635 -0.2644127 0.0100723 -0.3020346 -0.3252046 0.0493005 -0.0002433 0.0565308 -0.0456956 -0.2425447 -0.1800961 -0.1546038 -0.2186913 -0.2346677 -0.211427 -0.1581582 -0.2063112 -0.2063842 -0.022498 -0.0139144 -0.0755712 0.0209875 0.0958707 0.0427905 -0.0936367 0.0338063 0.0512146 0.0574679 0.0733648 0.0370219 0.070009 0.0117105 -0.027245 0.0018148 -0.0506521 0.1333473 0.1132657 -0.0351756 0.0126456 0.0185242 0.1494652 -0.0238729 0.0465457 -0.0132453 -0.0228198 -0.0719438 -0.0194619 0.0241046 0.0089358 0.1156586 -0.0252295 0.0527875 -0.0278325 0.0809318 0.116753 -0.0504873 0.0262259 0.0028829 0.1216564 0.0788408 0.010371 0.0476657 0.0014275 0.0738841 0.0695406 -0.0414521 0.0642089 -0.0085167 0.0091865 -0.007343 0.0348321 0.1365856 unknown
polarizability: 64.1061334|7.8828|51.0365939|1.1809744|-0.5820565|64.6597014 unknown
InChI: InChI=1S/C5H6O3/c1-3(6)5(8)4(2)7/h1-2H3
charge 0 multiplicity 1
14 atoms
O  0.112681 0.795113 -1.918012
O  0.956733 -0.285747 1.245093
O  -1.921802 0.921043 0.86067
C  -0.131198 0.598483 -0.699985
C  0.991395 0.613259 0.3657
C  -1.568903 0.330807 -0.193012
C  2.083275 1.64183 0.211614
C  -2.458746 -0.535989 -1.047534
H  2.923372 1.42013 0.887052
H  1.677249 2.643997 0.452608
H  2.425473 1.682613 -0.838042
H  -3.501195 -0.484449 -0.698672
H  -2.385844 -0.230983 -2.106988
H  -2.107691 -1.585309 -0.994892
