program: Gaussian 09
title: 000136699
version: EM64L-G09RevD.01
frameworkgroup: C1[X(CH2O2)]
method: RPBEPBE
basis: SDD
operation: Freq
keyword: #p
keyword: freq=noraman
keyword: PBEPBE/SDD
title: #p freq=noraman PBEPBE/SDD
converged: NO NO NO NO
title: Mulliken charges:
elementType: O O C H H
charge: -0.381817 -0.216951 0.007494 0.214744 0.376530
chargesum: 0.00000
title: Mulliken charges with hydrogens summed into heavy atoms:
elementType: O O C
charge: -0.005287 -0.216951 0.222238
polarizability: 2.37831490e+01 2.13236257e-01 1.89555302e+01 3.04404087e-04 9.32494270e-04 8.56344797e+00
1716.lowfreq: -30.1713 -0.0005 0.0003 0.0009 12.6212 47.6325 567.8493 675.8079 995.3775
frequency: 567.8424 675.8009 995.3749 1021.8641 1234.3525 1366.3421 1645.6258 3065.3035 3502.6302
redmass: 3.5876 1.3239 1.4741 3.5666 1.7155 1.1372 7.1108 1.0925 1.0639
irintensity: 40.6250 193.4032 21.7700 236.4515 3.5996 4.6552 288.7372 42.2285 20.9062
temp: 298.150 k
press: 1.00000 atm
elementType: 8 8 6 1 1
symmnumber: 1
zpe: 84188.0 jmol-1
zpe.correction: 0.032066 hartree
zpe.thermalcorrener: 0.035297 hartree
zpe.thermalcorrenthalpy: 0.036241 hartree
zpe.thermalcorrgfe: 0.007871 hartree
zpe.sumelectzpe: -189.503287 hartree
zpe.sumelectthermal: -189.500056 hartree
zpe.sumelectthermalent: -189.499111 hartree
zpe.sumelectthermalfe: -189.527481 hartree
dipole: 1.5196 0.0093 0.0000
dipole: 1.5196
quadrupole: -22.0256 -13.4313 -17.1899
quadrupole: -3.4105 -0.0004 0.0003
quadrupole: -4.4767 4.1177 0.3591 -3.4105 -0.0004 0.0003
hfenergy: -189.5353522 hartree
pointgroup: C01 [X(C1H2O2)]
dipole: -0.5969676 0.0328087 -0.0000058 debye
dipolederiv: -1.1284256 0.2657832 -0.0000074 0.4853462 -0.3412181 -0.0000274 -0.0000293 -0.0000195 -0.4455688 -0.9883638 0.0472395 0.0000057 -0.3236336 -0.5024882 0.0000181 0.0000492 0.0000153 -0.3311491 1.7685253 -0.1421875 -0.000019 -0.0799916 0.8669864 -0.0000453 -0.0000275 -0.0000482 0.1950084 0.0506428 -0.0651317 0.0000068 -0.0098611 -0.1330445 0.0000232 0.0000004 0.0000185 0.1626308 0.2976213 -0.1057036 0.0000139 -0.0718599 0.1097643 0.0000314 0.0000072 0.0000339 0.4190787 unknown
polarizability: 23.7911578|-0.0821094|18.9475214|-0.0003607|-0.0009122|8.563448 unknown
InChI: InChI=1S/CH2O2/c2-1-3/h1-2H
charge 0 multiplicity 1
5 atoms
O  -1.193991 0.181348 0.000049
O  1.14637 0.218698 -0.000012
C  0.066459 -0.401618 0.000074
H  -0.058901 -1.499538 0.000144
H  -1.125336 1.17571 -0.000055
