program: Gaussian 09
title: 000136695
version: EM64L-G09RevD.01
frameworkgroup: C1[X(C14H10N2O)]
method: RPBEPBE
basis: SDD
operation: Freq
keyword: #p
keyword: freq=noraman
keyword: PBEPBE/SDD
title: #p freq=noraman PBEPBE/SDD
converged: NO NO NO NO
title: Mulliken charges:
elementType: O N N C C C C C C C C C C C C C C H H H H H H H H H H
charge: -0.223861 -0.133478 -0.048906 0.274936 0.316284 0.139154 -0.006533 -0.330910 -0.369051 -0.346026 -0.376970 -0.227215 -0.220963 -0.229665 -0.228229 -0.227237 -0.232340 0.266422 0.269746 0.264735 0.270343 0.235251 0.235363 0.231312 0.230486 0.235547 0.231805
chargesum: 0.00000
title: Mulliken charges with hydrogens summed into heavy atoms:
elementType: O N N C C C C C C C C C C C C C C
charge: -0.223861 -0.133478 -0.048906 0.274936 0.316284 0.139154 -0.006533 -0.064488 -0.099305 -0.081291 -0.106626 0.008036 0.014400 0.001646 0.002257 0.008310 -0.000535
polarizability: 3.04339800e+02 -5.04237689e-01 1.65983596e+02 -2.50282283e-03 -1.17778503e-02 6.36739413e+01
1716.lowfreq: -0.0009 -0.0007 -0.0004 2.9919 6.7324 19.5509 39.7138 43.7319 67.9441
frequency: 39.6967 43.7178 67.9184 92.8761 123.6456 165.6304 240.0743 244.5831 318.8919 381.8903 395.7332 401.9211 403.1409 481.0961 488.6790 510.7028 613.7966 614.8500 655.9661 668.7237 697.8158 698.3809 700.7845 719.9805 781.5879 793.0775 835.6766 861.1260 863.2661 899.0431 926.8289 946.1167 948.0793 988.4282 989.4978 992.3056 992.9965 998.9670 1006.2908 1007.9292 1022.2684 1034.5904 1076.7643 1083.7934 1103.2827 1174.3287 1176.0727 1186.9454 1189.7215 1233.2349 1261.2252 1322.2583 1329.7753 1384.9178 1387.1980 1413.6612 1439.3064 1444.7835 1463.9102 1506.7450 1549.3278 1587.2186 1590.3403 1616.7388 1621.0154 3128.7766 3132.8914 3139.6598 3143.8694 3152.3339 3155.8721 3162.3471 3165.4269 3171.3452 3174.0308
redmass: 3.7273 4.9885 5.2220 7.8566 5.3116 5.1706 5.3972 6.3630 6.3192 6.5422 8.3468 2.8205 2.8364 3.6921 3.9664 8.3490 6.4733 6.4674 5.9930 6.6960 1.8260 6.8522 1.9644 3.3942 1.8505 2.2758 14.0577 1.2471 1.2468 13.0589 10.8507 1.4134 1.4251 6.2046 6.2342 1.3867 1.3836 7.4723 1.3263 1.3313 2.4922 2.0484 1.8018 1.6818 2.8467 1.0563 1.0573 1.1140 1.1161 5.2259 4.1444 1.3296 1.4676 8.8262 8.6629 3.3504 2.3200 2.3901 2.4094 3.5391 7.2355 6.2286 6.4176 6.0180 6.2058 1.0852 1.0855 1.0888 1.0888 1.0934 1.0933 1.0965 1.0966 1.1007 1.1013
irintensity: 0.0874 1.1687 0.9176 0.0352 0.0816 0.1090 0.0195 0.2172 0.2450 2.4363 1.3846 0.0027 0.0207 7.0093 1.8585 0.6649 0.1118 0.0074 0.0924 2.1166 32.8106 27.0492 54.9841 95.7389 2.5388 57.2080 18.4791 0.0012 0.0116 4.3631 3.8204 0.0056 10.6894 0.5277 0.2002 0.0013 0.0133 15.7925 0.4197 0.4319 24.6041 3.4720 23.7755 0.3890 21.3736 0.3394 0.1969 22.3536 2.0801 8.6318 32.3819 2.1876 15.6746 14.5597 7.1078 191.2094 22.0205 15.8485 84.6438 28.3313 66.0997 0.2363 3.2479 14.2621 4.8387 0.0822 0.0680 10.5277 9.1963 19.6368 15.9850 14.7388 11.2531 20.1839 17.4799
temp: 298.150 k
press: 1.00000 atm
elementType: 8 7 7 6 6 6 6 6 6 6 6 6 6 6 6 6 6 1 1 1 1 1 1 1 1 1 1
symmnumber: 1
zpe: 534298.2 jmol-1
zpe.correction: 0.203503 hartree
zpe.thermalcorrener: 0.216373 hartree
zpe.thermalcorrenthalpy: 0.217317 hartree
zpe.thermalcorrgfe: 0.162550 hartree
zpe.sumelectzpe: -723.029650 hartree
zpe.sumelectthermal: -723.016780 hartree
zpe.sumelectthermalent: -723.015836 hartree
zpe.sumelectthermalfe: -723.070604 hartree
dipole: -1.2723 1.9347 0.0000
dipole: 2.3155
quadrupole: -67.3316 -93.3097 -103.9323
quadrupole: 0.3957 -0.0011 -0.0030
quadrupole: 20.8596 -5.1185 -15.7411 0.3957 -0.0011 -0.0030
hfenergy: -723.2331536 hartree
pointgroup: C01 [X(C14H10N2O1)]
dipole: 0.5022295 -0.7600552 0.0000006 debye
polarizability: 304.341346|-0.2008239|165.9820494|0.002477|0.0117833|63.6739413 unknown
InChI: InChI=1S/C14H10N2O/c1-3-7-11(8-4-1)13-15-14(17-16-13)12-9-5-2-6-10-12/h1-10H
charge 0 multiplicity 1
27 atoms
O  0.72733 1.794082 0.000077
N  -0.006588 -0.360059 0.000077
N  -0.73404 1.853715 0.00008
C  2.48571 0.055839 0.000027
C  -2.495459 0.099551 0.000107
C  1.073412 0.425371 0.000058
C  -1.092455 0.537673 0.000089
C  3.500036 1.051722 0.000501
C  2.840545 -1.320661 -0.000444
C  -3.55326 1.048701 0.000005
C  -2.793058 -1.288453 0.000222
C  4.856498 0.668842 0.00049
C  4.199296 -1.693464 -0.000452
C  -4.891924 0.609299 0.000021
C  -4.135928 -1.721208 0.000236
C  5.210298 -0.701863 0.000012
C  -5.188496 -0.775815 0.000137
H  3.219756 2.109936 0.000884
H  2.046169 -2.07373 -0.000786
H  -3.31648 2.117899 -0.000091
H  -1.966908 -2.006327 0.000299
H  5.637041 1.437102 0.000861
H  4.471135 -2.754421 -0.00082
H  -5.704438 1.344077 -0.000059
H  -4.361116 -2.793339 0.000323
H  6.265928 -0.995191 -0.000003
H  -6.230804 -1.113975 0.000149
