program: Gaussian 09
title: 000136694
version: EM64L-G09RevD.01
frameworkgroup: C1[X(C16H18)]
method: RPBEPBE
basis: SDD
operation: Freq
keyword: #p
keyword: freq=noraman
keyword: PBEPBE/SDD
title: #p freq=noraman PBEPBE/SDD
converged: YES YES NO NO
title: Mulliken charges:
elementType: C C C C C C C C C C C C C C C C H H H H H H H H H H H H H H H H H H
charge: -0.232455 0.545423 0.503005 -0.706648 -0.404072 -0.464155 -0.692901 -0.693358 -0.396145 -0.456161 0.497637 -0.377113 -0.449900 -0.225925 -0.222132 -0.250372 0.206732 0.222992 0.225119 0.226898 0.230155 0.211039 0.210663 0.227082 0.226774 0.210819 0.210712 0.239022 0.229123 0.242926 0.230646 0.223735 0.223917 0.226921
chargesum: 0.00000
title: Mulliken charges with hydrogens summed into heavy atoms:
elementType: C C C C C C C C C C C C C C C C
charge: -0.025723 0.545423 0.503005 -0.258538 -0.177174 -0.234000 -0.044116 -0.045054 -0.157123 -0.227038 0.497637 -0.134187 -0.219254 -0.002190 0.001784 -0.023451
polarizability: 2.25173528e+02 -3.51224148e+00 1.44976363e+02 -1.83816318e+01 7.90269671e-01 1.32822696e+02
1716.lowfreq: -19.9112 -0.0007 -0.0005 0.0006 3.5234 8.0616 23.6292 25.8106 34.8294
frequency: 19.8200 25.1075 34.6253 57.3776 99.5103 163.3699 202.4950 212.8253 227.7475 242.3759 255.4830 320.4199 335.2344 379.4406 405.0785 408.2629 449.4976 471.0486 536.8180 542.8128 600.7019 616.0308 637.8957 697.2250 706.4049 738.3415 751.9906 799.5368 825.9542 845.0568 850.9815 855.8096 890.0280 907.3345 917.6269 944.7042 954.7940 964.2352 975.7905 978.1518 990.7058 994.9880 1012.9264 1026.1934 1051.4265 1080.9731 1112.5681 1113.2530 1154.9225 1170.6108 1182.1936 1188.0711 1192.8238 1197.9685 1221.0853 1223.0887 1284.3025 1296.0291 1308.3914 1332.5945 1342.5063 1376.7799 1380.6723 1384.9608 1396.1448 1414.3105 1439.0413 1460.0917 1466.5183 1468.3385 1479.3286 1483.3781 1484.9143 1507.7873 1582.1486 1592.9641 1613.0985 1623.4387 2967.8170 2973.9443 2976.3368 2978.9270 3013.2246 3066.8803 3073.5065 3076.7357 3081.1298 3106.1692 3113.6533 3113.8721 3119.5399 3129.5225 3132.5859 3139.3567 3143.1278 3160.9717
redmass: 3.3877 3.4358 3.8185 3.6412 3.5165 3.4696 1.8717 1.5042 2.3487 2.8624 1.3635 2.5657 2.5178 3.5855 2.8173 2.8460 3.1198 3.0718 2.8651 3.2848 3.6108 6.2087 6.7876 3.2713 1.7954 2.1220 2.6704 2.7239 4.2848 1.6897 1.2992 1.2476 2.5584 1.4712 1.1807 1.5823 1.4589 1.5644 1.3870 1.3895 5.9339 1.3292 3.0404 2.2237 1.5405 1.6040 1.6930 2.2311 1.7467 1.0608 1.1428 1.1999 1.2136 2.0941 1.7833 2.3406 1.6134 1.8374 1.3213 1.3437 1.3875 1.1955 6.5379 4.3820 1.2539 2.4106 2.1010 1.1463 1.0448 1.0509 1.0489 2.1890 1.1055 2.3575 6.4435 6.0717 6.0776 6.3818 1.0594 1.0347 1.0370 1.0823 1.1001 1.0999 1.0991 1.1005 1.0996 1.0868 1.0865 1.0865 1.0863 1.0961 1.0913 1.0965 1.0961 1.1015
irintensity: 0.0343 0.0187 0.1735 0.0169 0.6378 0.2266 0.4295 0.7639 0.6091 0.0262 0.5544 0.8548 0.4755 0.9077 0.2631 0.1321 2.7070 5.9805 18.7356 2.3216 14.1625 0.4693 0.5924 2.0444 48.3092 32.4087 22.6056 18.6229 0.3531 27.7771 4.5469 0.0951 1.9191 3.1949 3.0072 2.8914 0.0246 0.9565 0.2800 0.0432 0.2254 0.5607 9.5497 9.5123 28.3408 12.8652 13.5455 5.2363 0.5198 0.2723 2.1469 0.8338 2.7375 0.9925 0.5957 3.3859 3.5495 8.0451 0.8633 1.1733 0.9310 15.6138 0.7588 3.7392 8.3540 6.7290 6.4246 17.7126 2.9240 2.8663 15.6401 18.6826 6.4888 41.5845 0.7927 0.8646 11.9424 0.2288 30.8533 32.6069 37.5281 19.7371 13.3665 0.1630 110.5095 25.0439 40.8917 15.3424 18.4729 8.5152 1.3617 41.2017 14.7902 4.4487 45.7436 25.6685
temp: 298.150 k
press: 1.00000 atm
elementType: 6 6 6 6 6 6 6 6 6 6 6 6 6 6 6 6 1 1 1 1 1 1 1 1 1 1 1 1 1 1 1 1 1 1
symmnumber: 1
zpe: 758712.3 jmol-1
zpe.correction: 0.288978 hartree
zpe.thermalcorrener: 0.303966 hartree
zpe.thermalcorrenthalpy: 0.304910 hartree
zpe.thermalcorrgfe: 0.244575 hartree
zpe.sumelectzpe: -619.355952 hartree
zpe.sumelectthermal: -619.340964 hartree
zpe.sumelectthermalent: -619.340020 hartree
zpe.sumelectthermalfe: -619.400354 hartree
dipole: 0.4481 -0.0310 -0.0052
dipole: 0.4492
quadrupole: -89.1544 -93.3095 -93.7114
quadrupole: -0.1749 -4.1417 0.4124
quadrupole: 2.9041 -1.2511 -1.6530 -0.1749 -4.1417 0.4124
hfenergy: -619.6449299 hartree
pointgroup: C01 [X(C16H18)]
dipole: 0.1757023 0.0158663 0.0103877 debye
polarizability: 221.7499508|12.884382|144.0071051|22.1201555|-2.740033|137.2155314 unknown
InChI: InChI=1S/C16H18/c1-13(2)16-10-8-15(9-11-16)12-14-6-4-3-5-7-14/h3-11,13H,12H2,1-2H3
charge 0 multiplicity 1
34 atoms
C  4.223292 -0.206443 0.591761
C  2.786238 0.204255 0.257708
C  0.093695 0.989622 -0.37956
C  -1.321121 1.426756 -0.755809
C  1.916938 -0.662972 -0.45745
C  2.2797 1.466897 0.649982
C  5.066611 -0.421682 -0.694153
C  4.266948 -1.467751 1.494991
C  0.597014 -0.27958 -0.768911
C  0.955509 1.853633 0.337237
C  -2.427264 0.423953 -0.426536
C  -2.499421 -0.189459 0.851598
C  -3.429009 0.116092 -1.380848
C  -3.548881 -1.079465 1.167982
C  -4.481663 -0.775552 -1.068956
C  -4.546361 -1.375897 0.208786
H  4.684783 0.627682 1.158595
H  -1.359445 1.646465 -1.84177
H  -1.538357 2.386033 -0.244038
H  2.275398 -1.650207 -0.774432
H  2.927817 2.155344 1.207094
H  4.658809 -1.251928 -1.300565
H  6.112627 -0.673026 -0.436844
H  5.072037 0.485397 -1.325017
H  3.696639 -1.310438 2.428085
H  5.310475 -1.718587 1.762442
H  3.832137 -2.342691 0.976663
H  -0.05754 -0.971238 -1.313144
H  0.589484 2.838714 0.654106
H  -1.723451 0.028755 1.595173
H  -3.38493 0.57782 -2.375555
H  -3.589666 -1.542689 2.16065
H  -5.246256 -1.001927 -1.821035
H  -5.360285 -2.067587 0.45377
