program: Gaussian 09
title: 000136691
version: EM64L-G09RevD.01
frameworkgroup: C1[X(C10H8N4)]
method: RPBEPBE
basis: SDD
operation: Freq
keyword: #pfreq=noraman
keyword: PBEPBE/SDD
title: #p freq=noraman PBEPBE/SDD
converged: NO NO NO NO
title: Mulliken charges:
elementType: N N N N C C C C C C C C C C H H H H H H H H
charge: -0.225659 -0.225660 -0.130324 -0.130324 0.268129 0.268133 -0.173486 -0.173487 -0.339701 -0.339703 -0.246569 -0.246566 -0.155388 -0.155391 0.275135 0.275136 0.253781 0.253782 0.234752 0.234750 0.239329 0.239331
chargesum: 0.00000
title: Mulliken charges with hydrogens summed into heavy atoms:
elementType: N N N N C C C C C C C C C C
charge: -0.225659 -0.225660 -0.130324 -0.130324 0.268129 0.268133 0.101649 0.101649 -0.085920 -0.085922 -0.011817 -0.011815 0.083941 0.083939
polarizability: 2.73974486e+02 4.53233131e+00 1.36024163e+02 -2.18268666e-03 -1.75869736e-03 5.16699562e+01
1716.lowfreq: -13.1966 -0.0010 -0.0007 0.0005 3.9784 9.3793 54.9313 92.0481 199.4879
frequency: 54.9313 92.0481 199.4879 237.9031 258.2152 287.3604 401.9525 407.5537 416.8128 432.3874 516.0705 521.1183 527.5969 606.4690 621.3246 663.1433 692.4065 692.6365 695.6020 737.7511 742.2564 771.3876 823.6514 825.3107 849.0819 903.1794 922.2413 922.6592 969.6462 969.8890 1017.2267 1025.6033 1050.4711 1060.0882 1109.6442 1147.7947 1152.3536 1153.2976 1245.6901 1269.4774 1299.5540 1313.3368 1365.9278 1393.1303 1441.8522 1444.9902 1464.2693 1499.0360 1526.7595 1534.4751 1614.0607 1649.0793 3148.1241 3148.2585 3180.7222 3180.8438 3187.0769 3187.0893 3207.1505 3207.3695
redmass: 4.5215 4.8766 6.2207 4.7811 5.1316 6.7297 6.6723 3.7682 5.4647 3.2227 3.1913 8.9146 4.0306 9.6475 7.1489 6.1797 4.5841 5.6114 6.7173 1.2379 1.2364 6.9185 1.3622 1.4134 6.8379 6.6606 1.3315 1.3277 1.3009 1.2985 2.2360 2.2005 5.8905 4.7922 1.9203 1.3929 1.1520 1.1299 1.6071 2.1316 3.5048 2.0078 1.8598 3.4051 2.9067 2.7180 4.6990 4.5282 6.4077 6.5933 6.0879 7.3171 1.0887 1.0888 1.0928 1.0929 1.0918 1.0919 1.1003 1.1004
irintensity: 3.7945 3.8009 0.0000 5.1070 0.0000 6.7960 0.0000 2.8738 0.0000 0.0000 21.6578 0.0000 0.0000 0.0000 3.7487 10.2164 0.5288 0.0000 0.0000 215.6217 0.0002 6.6271 0.0000 10.8732 0.4350 0.0000 0.0001 4.0558 1.2164 0.0004 1.5353 0.0000 66.1968 0.0000 0.0000 51.8746 0.0000 14.5117 0.0000 34.2064 0.0000 92.8355 0.0000 60.5725 0.0000 3.3140 0.0000 259.8573 0.0000 115.3019 0.0000 562.9296 27.4651 0.3520 6.6056 0.0009 0.8257 3.5605 6.3275 0.0075
temp: 298.150 k
press: 1.00000 atm
elementType: 7 7 7 7 6 6 6 6 6 6 6 6 6 6 1 1 1 1 1 1 1 1
symmnumber: 1
zpe: 430576.8 jmol-1
zpe.correction: 0.163998 hartree
zpe.thermalcorrener: 0.174009 hartree
zpe.thermalcorrenthalpy: 0.174954 hartree
zpe.thermalcorrgfe: 0.128244 hartree
zpe.sumelectzpe: -603.827897 hartree
zpe.sumelectthermal: -603.817886 hartree
zpe.sumelectthermalent: -603.816942 hartree
zpe.sumelectthermalfe: -603.863652 hartree
dipole: 0.0000 0.0000 0.0003
dipole: 0.0003
quadrupole: -59.2486 -78.0566 -86.2746
quadrupole: 1.0120 -0.0005 -0.0003
quadrupole: 15.2780 -3.5300 -11.7480 1.0120 -0.0005 -0.0003
hfenergy: -603.9918955 hartree
pointgroup: C01 [X(C10H8N4)]
dipole: -0.000006 0.000001 -0.0001328 debye
dipolederiv: -0.007607 0.0734197 -0.0000193 1.0874608 -0.2216263 -0.0000347 0.0000754 -0.000012 0.0629851 -0.0076124 0.0734182 0.0000192 1.0874517 -0.221623 0.0000131 0.0000311 0.0000166 0.0629841 -1.1833137 0.1459511 -0.0000087 0.448062 -0.2290677 -0.00001 -0.0000678 0.0000165 -0.3010939 -1.1833092 0.1459506 0.0000492 0.4480656 -0.2290689 -0.0000058 0.0000385 -0.0000078 -0.3010937 1.3634483 -0.3744421 -0.0000412 -0.8978544 0.1347723 0.0000209 -0.0000296 0.0000028 0.1393754 1.363458 -0.3744438 0.0000081 -0.8978459 0.1347694 -0.0000047 -0.0000172 -0.0000012 0.1393758 0.7232646 0.2371456 -0.0000067 -0.2271438 0.1541039 0.0000161 -0.0000351 -0.0000107 -0.021552 0.7232616 0.2371505 -0.0000056 -0.227139 0.1541043 -0.0000035 -0.0000213 0.0000027 -0.021551 -0.6895495 0.3190148 0.0000334 -0.1570827 0.0158874 0.0000302 -0.0000165 -0.0000064 -0.2187009 -0.6895591 0.3190131 -0.0000161 -0.1570859 0.0158865 -0.0000185 0.0000289 -0.0000071 -0.2187015 -0.498713 -0.2623224 -0.000034 -0.1905671 -0.4380219 -0.0000027 -0.0000299 0.0000111 -0.2782224 -0.4987051 -0.262326 0.0000139 -0.190569 -0.4380261 0.0000033 -0.0000033 -0.0000048 -0.2782212 0.201218 -0.1187213 -0.0000286 -0.0199412 0.5036932 0.0000548 0.0000007 0.0000575 -0.0751954 0.201216 -0.1187224 0.0000106 -0.0199461 0.5036962 -0.0000288 0.0000067 -0.0000291 -0.0751952 0.1173429 -0.0411483 0.000002 -0.0065066 0.017173 -0.0000122 0.0000146 -0.0000118 0.1711568 0.1173429 -0.0411472 -0.0000011 -0.0065066 0.0171735 0.0000044 0.0000026 0.0000051 0.1711568 0.0782978 0.0325515 0.0000079 -0.0192342 -0.0298922 -0.0000193 -0.0000101 -0.0000126 0.1737905 0.0782983 0.0325523 -0.0000029 -0.0192336 -0.0298906 0.0000094 0.0000095 0.0000046 0.1737907 -0.0290953 0.0805588 0.0000225 0.0787469 0.0346696 -0.0000211 0.0000241 -0.0000228 0.194443 -0.0290973 0.0805593 -0.0000071 0.0787496 0.0346688 0.0000093 -0.0000031 0.0000109 0.194442 -0.0752949 -0.0920061 0.0000038 -0.0959402 0.0583094 -0.0000044 0.000006 -0.0000053 0.1530133 -0.0752919 -0.0920058 0.0000009 -0.0959404 0.0583092 0.0000039 -0.0000041 0.0000039 0.1530137 unknown
polarizability: 273.9226883|-5.261645|136.0759613|-0.0021734|0.0017702|51.6699562 unknown
InChI: InChI=1S/C10H8N4/c1-3-7-13-9(5-1)11-14-8-4-2-6-10(14)12-13/h1-8H
charge 0 multiplicity 1
22 atoms
N  1.190589 -0.671413 0.000094
N  -1.190593 0.671406 0.000103
N  -0.020924 -1.470835 0.000149
N  0.020922 1.470828 0.000193
C  1.158373 0.746587 0.000196
C  -1.158375 -0.746596 0.000126
C  2.35691 -1.393443 -0.000044
C  -2.356914 1.393435 0.00004
C  2.44218 1.40348 0.000198
C  -2.442175 -1.40349 0.000162
C  3.600035 -0.760139 -0.000075
C  -3.600035 0.760127 0.000032
C  3.627191 0.670057 0.000062
C  -3.627189 -0.670066 0.000106
H  2.208905 -2.474925 -0.000118
H  -2.208912 2.474918 0.000018
H  2.42647 2.496326 0.000297
H  -2.426463 -2.496335 0.000216
H  4.515214 -1.354468 -0.000204
H  -4.515216 1.354459 -0.000014
H  4.58866 1.194477 0.000052
H  -4.588652 -1.194489 0.000112
