program: Gaussian 09
title: 000136683
version: EM64L-G09RevD.01
frameworkgroup: C1[X(C6H6N4O)]
method: RPBEPBE
basis: SDD
operation: Freq
keyword: #pfreq=noraman
keyword: PBEPBE/SDD
title: #p freq=noraman PBEPBE/SDD
converged: NO NO NO NO
title: Mulliken charges:
elementType: O N N N N C C C C C C H H H H H H
charge: -0.198946 -0.158842 -0.364340 -0.027734 -0.001274 0.325677 -0.083390 -0.235191 -0.635438 0.036094 -0.234988 0.269406 0.320902 0.246962 0.246957 0.254121 0.240024
chargesum: 0.00000
title: Mulliken charges with hydrogens summed into heavy atoms:
elementType: O N N N N C C C C C C
charge: -0.198946 -0.158842 -0.043439 -0.027734 -0.001274 0.325677 -0.083390 0.034215 0.112602 0.036094 0.005036
polarizability: 1.26447769e+02 3.46802231e+00 1.05336020e+02 9.87171188e-03 1.13981185e-03 4.33119936e+01
1716.lowfreq: -4.6813 0.0004 0.0006 0.0009 10.3025 11.8733 87.2541 120.4794 133.9315
frequency: 87.2335 120.4386 133.9202 214.5127 237.6392 291.1615 345.3987 475.9814 481.4056 500.8477 531.2680 581.5024 624.7174 660.8369 674.5268 696.8077 761.7885 788.0262 859.2090 886.0324 931.8313 1008.8651 1033.2877 1092.8409 1120.9536 1182.3584 1246.1719 1277.5803 1324.1060 1348.6893 1361.8484 1410.2600 1448.5032 1475.3127 1481.6836 1514.2738 1540.8245 1597.0560 1631.2891 2984.2619 3068.6422 3110.2715 3124.8055 3231.7341 3536.0100
redmass: 5.1314 1.0770 4.5677 3.5040 4.4553 5.7624 7.0402 8.0304 2.8229 6.2141 1.2907 6.6267 3.3125 12.0482 7.3753 6.4612 2.0558 3.4067 8.0022 1.4622 7.5793 2.7786 2.8813 3.1233 1.3150 2.1408 1.8565 4.2829 2.6249 3.9232 1.6011 2.7703 1.3555 1.0405 1.1769 3.1830 6.6142 6.2408 12.2399 1.0353 1.1031 1.0988 1.0925 1.0986 1.0793
irintensity: 0.2888 0.0063 0.5520 0.2687 0.5803 6.3366 0.8686 0.2400 36.3626 1.4526 87.8710 1.4638 4.3489 5.8569 12.4278 6.9517 25.4911 1.7068 3.3557 12.3717 54.2697 32.8863 1.7628 51.0142 0.3992 11.5672 9.0392 2.7815 35.1576 25.7369 10.6623 6.0909 13.0017 18.4725 8.5132 21.0170 289.5462 66.8735 357.1683 44.5723 20.2174 6.7395 21.6621 0.1110 31.5348
temp: 298.150 k
press: 1.00000 atm
elementType: 8 7 7 7 7 6 6 6 6 6 6 1 1 1 1 1 1
symmnumber: 1
zpe: 323211.3 jmol-1
zpe.correction: 0.123105 hartree
zpe.thermalcorrener: 0.132062 hartree
zpe.thermalcorrenthalpy: 0.133007 hartree
zpe.thermalcorrgfe: 0.088864 hartree
zpe.sumelectzpe: -525.662957 hartree
zpe.sumelectthermal: -525.654000 hartree
zpe.sumelectthermalent: -525.653056 hartree
zpe.sumelectthermalfe: -525.697198 hartree
dipole: 10.1365 6.9934 0.0017
dipole: 12.3149
quadrupole: -67.0924 -60.9225 -64.0688
quadrupole: -4.3224 0.0011 -0.0003
quadrupole: -3.0645 3.1054 -0.0409 -4.3224 0.0011 -0.0003
hfenergy: -525.7860622 hartree
pointgroup: C01 [X(C6H6N4O1)]
dipole: 3.8831796 -2.8974941 -0.0006647 debye
dipolederiv: -0.8941486 0.3555201 0.0000636 0.5033787 -0.7806877 -0.0000508 0.0000618 -0.0000405 -0.3439792 -0.6619509 0.1444148 0.0000147 0.2414707 -0.3885543 -0.0000312 -0.0001722 0.0000564 -0.110891 -0.9345362 -0.0657867 0.0000756 -0.0703322 -0.6464082 0.0000032 0.0000761 0.0000763 -0.2060817 -0.4265674 0.0527273 0.000014 0.1035089 -0.3262298 -0.0000198 -0.0000171 -0.000022 -0.222078 -0.5717586 0.0742078 0.0000294 0.4797145 -0.9024448 -0.0000385 0.0000063 0.0000024 -0.2705722 0.6089096 0.0163048 0.00002 0.0596971 0.5227392 -0.000089 0.0000342 -0.0001638 0.0905857 -0.5036011 0.3406265 0.0000681 0.1718653 -0.0741185 0.0000134 0.000092 -0.0000248 -0.0370796 0.1027069 -0.171636 0.0000696 -0.3725744 0.4869531 0.000065 0.0001845 0.0000752 -0.1032285 0.4427986 -0.1840713 -0.0000311 -0.2455697 0.2137096 0.0000695 0.0000076 0.0000034 0.2504209 1.2931292 -0.4163141 -0.0001264 -0.5837582 1.2965617 0.0000347 -0.000103 0.0000414 0.2501012 1.2773226 -0.1442313 -0.0001395 -0.3287322 0.4622422 0.000027 -0.0001344 0.0000072 -0.0109001 -0.0115901 -0.0462859 0.0000019 -0.0124156 0.101381 -0.0000062 -0.0000422 -0.0000207 0.1875916 0.1246274 0.0261804 0.000022 -0.0010073 0.1639213 0.0000054 0.0000223 -0.0000148 0.3441005 0.0393035 0.0191155 0.0403556 0.1116102 -0.0073762 0.0921198 -0.0322683 0.1089759 -0.0433638 0.039302 0.0189908 -0.0405085 0.1115054 -0.0073467 -0.092176 0.032182 -0.1089738 -0.0433548 -0.0118143 -0.0316934 0.0000655 -0.1410051 0.020072 0.0000626 0.0000605 0.0000173 0.1321929 0.0878675 0.0119307 0.0000054 -0.0273561 -0.134414 0.0000109 0.0000098 0.0000049 0.136536 unknown
polarizability: 126.1615067|-4.2413114|105.6222823|-0.0098226|0.0015053|43.3119936 unknown
InChI: InChI=1S/C6H6N4O/c1-10-3-9-4-5(10)7-2-8-6(4)11/h2-3,7H,1H3
charge 0 multiplicity 1
17 atoms
O  -2.589726 1.445239 0.000262
N  1.877563 -0.003832 -0.000134
N  0.079421 -1.75643 0.000002
N  0.513088 1.841197 -0.000011
N  -2.174553 -0.878703 0.000246
C  0.565798 -0.457873 -0.000111
C  -0.27736 0.675079 -0.000009
C  1.779917 1.40982 -0.00012
C  3.102376 -0.811289 -0.000813
C  -1.742184 0.51734 0.000169
C  -1.325116 -1.876903 0.000167
H  2.667015 2.039984 -0.000049
H  0.679654 -2.583395 -0.000054
H  3.163235 -1.446202 0.901895
H  3.162256 -1.446111 -0.903643
H  3.971362 -0.134393 -0.001239
H  -1.694845 -2.909828 0.000243
