program: Gaussian 09
title: 000136670
version: EM64L-G09RevD.01
frameworkgroup: C1[X(C10H20O)]
method: RPBEPBE
basis: SDD
operation: Freq
keyword: #pfreq=noraman
keyword: PBEPBE/SDD
title: #p freq=noraman PBEPBE/SDD
converged: YES YES NO NO
title: Mulliken charges:
elementType: O C C C C C C C C C C H H H H H H H H H H H H H H H H H H H H
charge: -0.212810 0.295521 -0.536351 0.180315 0.180730 -0.724587 -0.717639 -0.726732 -0.701804 -0.707619 -0.719625 0.235618 0.229607 0.265025 0.193777 0.201217 0.204625 0.217733 0.205603 0.196410 0.255291 0.204603 0.208835 0.235213 0.220389 0.200428 0.242347 0.215988 0.219503 0.221611 0.216782
chargesum: 0.00000
title: Mulliken charges with hydrogens summed into heavy atoms:
elementType: O C C C C C C C C C C
charge: -0.212810 0.295521 -0.071127 0.180315 0.180730 -0.064570 -0.089678 -0.070430 -0.037367 -0.048856 -0.061729
polarizability: 1.24063482e+02 3.81756015e-01 1.05727497e+02 6.22999990e-01 -2.10475520e-01 9.89523949e+01
1716.lowfreq: -7.4962 -0.0007 -0.0007 0.0005 5.8709 12.5182 28.1993 46.0153 114.9190
frequency: 28.1970 45.7592 114.9129 138.9922 172.6570 195.5065 210.0088 219.5503 243.2136 246.4236 258.3367 265.0816 279.0396 315.6107 329.3277 351.8204 362.4742 393.0787 396.2188 419.8886 478.0561 558.7663 581.5829 732.7148 776.3308 836.7562 880.4440 912.4571 925.3379 926.9607 930.8274 935.0453 945.9593 948.2052 1001.3808 1008.2276 1027.7545 1040.0067 1062.2626 1146.9594 1197.8316 1207.7784 1228.5250 1252.6832 1260.4772 1282.7379 1330.8448 1370.0293 1371.3280 1374.3817 1377.0279 1397.6342 1401.6972 1419.3077 1454.6329 1456.6739 1463.7814 1464.3257 1466.9353 1471.4663 1475.8087 1479.8654 1483.0073 1487.7783 1494.9387 1502.1824 1611.9134 2950.4662 2960.3115 2967.7344 2973.0739 2974.1621 2976.6213 2985.6446 3002.7339 3052.0597 3056.3888 3057.2564 3066.1647 3068.6620 3070.4546 3078.4175 3079.0847 3082.3821 3094.2500 3101.3099 3104.4413
redmass: 3.4473 2.7415 2.7151 2.9948 1.0801 1.1796 1.4811 2.7139 1.1167 1.0884 1.0648 1.3669 2.2520 2.6960 2.0804 3.0870 2.3098 2.4710 1.9210 2.4575 2.5781 3.0703 2.8538 3.8951 4.1167 2.8801 2.2685 2.1773 1.7335 1.6578 1.5840 1.5657 1.2184 1.2074 1.4236 1.4695 1.4344 1.4737 1.9909 1.4061 2.6107 2.4095 3.1264 3.0139 2.9954 1.9807 1.8196 1.1962 1.1889 1.2052 1.1960 1.2035 1.2005 1.0990 1.0501 1.0485 1.0511 1.0484 1.0494 1.0481 1.0532 1.0622 1.0518 1.0574 1.0645 1.0618 8.3401 1.0604 1.0352 1.0371 1.0382 1.0343 1.0353 1.0363 1.0945 1.0994 1.0990 1.0988 1.0983 1.0999 1.1001 1.0999 1.0993 1.0998 1.0985 1.0987 1.0975
irintensity: 0.8170 0.1031 2.5966 1.2371 0.1744 0.2906 0.0311 1.1693 0.0940 0.0254 0.1276 0.0578 0.0334 2.5911 0.1924 6.8085 1.2677 0.1264 0.4068 0.1126 0.7769 2.5599 0.4569 2.5288 1.5407 9.9033 2.0669 45.2672 3.3090 2.1542 0.9774 3.2267 0.5966 0.2331 5.6790 5.9328 0.1301 0.0116 55.5408 2.9674 2.3430 3.1313 8.1534 5.4040 17.9642 9.6337 58.8945 14.6363 36.6547 28.5204 27.2032 13.0694 18.3616 6.9173 1.3213 0.6205 2.3673 1.6295 0.5091 1.7416 10.9115 27.9261 10.8868 5.6044 38.9258 25.2870 85.5305 26.8785 31.5151 53.7646 21.1292 32.5341 24.7738 29.3508 13.4142 1.0880 46.8917 35.2376 106.3705 9.1320 14.5064 34.2140 56.7740 40.9122 13.8093 24.5855 15.7916
temp: 298.150 k
press: 1.00000 atm
elementType: 8 6 6 6 6 6 6 6 6 6 6 1 1 1 1 1 1 1 1 1 1 1 1 1 1 1 1 1 1 1 1
symmnumber: 1
zpe: 724514.4 jmol-1
zpe.correction: 0.275953 hartree
zpe.thermalcorrener: 0.290565 hartree
zpe.thermalcorrenthalpy: 0.291510 hartree
zpe.thermalcorrgfe: 0.235594 hartree
zpe.sumelectzpe: -467.369862 hartree
zpe.sumelectthermal: -467.355250 hartree
zpe.sumelectthermalent: -467.354306 hartree
zpe.sumelectthermalfe: -467.410222 hartree
dipole: 0.6635 2.7468 -0.0063
dipole: 2.8258
quadrupole: -68.1798 -75.9525 -70.1394
quadrupole: 1.3395 0.2630 -0.3066
quadrupole: 3.2441 -4.5286 1.2845 1.3395 0.2630 -0.3066
hfenergy: -467.6458152 hartree
pointgroup: C01 [X(C10H20O1)]
dipole: 0.2526692 0.9788423 -0.4626687 debye
polarizability: 124.0329592|0.899913|104.3411958|0.6687966|-2.7413056|100.3692191 unknown
InChI: InChI=1S/C10H20O/c1-9(2,3)7-8(11)10(4,5)6/h7H2,1-6H3
charge 0 multiplicity 1
31 atoms
O  0.361493 -1.472881 0.739156
C  -2.06016 0.105091 0.016979
C  -0.60403 0.476949 -0.393772
C  1.992752 0.205246 0.020757
C  0.550425 -0.367496 0.161138
C  -2.450924 -1.294117 -0.531893
C  -3.003041 1.171289 -0.606936
C  -2.21647 0.131919 1.560958
C  2.177837 1.240667 1.176694
C  3.025119 -0.936518 0.189756
C  2.208337 0.910339 -1.346116
H  -0.5231 0.436813 -1.502218
H  -0.408435 1.53778 -0.131664
H  -1.805106 -2.07687 -0.102354
H  -2.35927 -1.327183 -1.635169
H  -3.502587 -1.524284 -0.275103
H  -2.773476 2.185874 -0.227475
H  -4.056592 0.946507 -0.356045
H  -2.915002 1.189774 -1.71057
H  -1.922126 1.116282 1.975318
H  -1.595266 -0.646827 2.033953
H  -3.271405 -0.048427 1.841038
H  1.465921 2.082664 1.096616
H  2.04079 0.759964 2.162066
H  3.201632 1.65647 1.135089
H  4.050968 -0.524144 0.168386
H  2.872285 -1.469041 1.142848
H  2.931784 -1.680395 -0.622228
H  2.047934 0.21295 -2.189369
H  1.539455 1.778422 -1.481772
H  3.249259 1.278484 -1.408068
