program: Gaussian 09
title: 000011782
version: EM64L-G09RevD.01
frameworkgroup: C1[X(C9H10O2)]
method: RPBEPBE
basis: SDD
operation: Freq
keyword: #pfreq=noraman
keyword: PBEPBE/SDD
title: #p freq=noraman PBEPBE/SDD
converged: YES YES NO NO
title: Mulliken charges:
elementType: O O C C C C C C C C C H H H H H H H H H H
charge: -0.448848 -0.258537 0.194898 0.330732 0.127751 -0.414340 -0.806939 -0.334860 -0.837561 -0.226122 0.100352 0.233514 0.235712 0.252826 0.253021 0.282157 0.236286 0.236097 0.229535 0.232875 0.381452
chargesum: 0.00000
title: Mulliken charges with hydrogens summed into heavy atoms:
elementType: O O C C C C C C C C C
charge: -0.067396 -0.258537 0.194898 0.330732 0.127751 -0.180826 -0.065380 -0.052703 -0.135644 0.006753 0.100352
polarizability: 1.37012863e+02 3.27615332e+00 1.20873192e+02 1.06756547e-02 1.97181516e-02 5.08532505e+01
1716.lowfreq: -9.9948 -6.4393 -0.0009 -0.0007 -0.0001 4.7270 31.1925 88.5867 134.1737
frequency: 31.1638 88.5696 134.1701 193.6457 210.3245 219.4494 263.6521 352.6660 360.1587 382.9093 468.1861 488.1106 508.7416 522.6752 591.3354 595.0802 650.5305 699.4118 741.8946 803.5786 814.6301 846.0329 933.5129 986.9547 994.2770 1003.2841 1027.8139 1053.2223 1082.7971 1096.9003 1174.4050 1191.2702 1213.1575 1261.2628 1309.0490 1365.7993 1399.9893 1405.9783 1437.0147 1443.8528 1457.2191 1470.9531 1485.0571 1490.7015 1588.8862 1599.0790 1634.9571 2979.0476 3002.2859 3056.8824 3072.6057 3085.1511 3119.6217 3123.1618 3152.2238 3186.9355 3528.7941
redmass: 5.7673 2.6651 1.1822 3.4250 1.1645 5.1628 2.3898 4.8033 3.0552 4.9081 3.1469 4.9164 2.8604 3.9335 5.4919 1.2573 4.3448 4.0129 2.0566 4.9942 1.8211 3.6224 1.3486 2.4436 1.3644 1.4628 1.4559 1.6570 1.8502 1.9841 1.3001 2.7350 2.2160 1.7593 2.7050 5.1430 1.2489 1.2206 2.3048 1.9681 1.0453 1.4810 1.0464 1.1224 6.8961 5.8262 7.7874 1.0376 1.0386 1.0975 1.0954 1.0987 1.0982 1.0886 1.0937 1.0956 1.0641
irintensity: 0.6107 0.2257 0.5464 0.0746 3.5935 1.1608 7.6864 5.5817 1.8256 0.7636 2.3002 3.4341 4.8375 7.5733 30.0830 132.8505 19.1642 15.7728 52.8931 0.9707 20.7742 16.3541 1.7142 148.3622 0.0085 45.7476 12.2532 0.7929 165.5613 20.0670 20.1707 17.8634 5.2472 1.4501 77.7548 8.7796 14.5717 20.5710 19.3295 8.0360 21.5208 44.3134 2.1971 8.9661 29.7595 6.4949 257.0343 26.5535 10.4142 19.1032 7.9878 20.3095 21.9260 16.4245 20.6812 5.3433 42.3172
temp: 298.150 k
press: 1.00000 atm
elementType: 8 8 6 6 6 6 6 6 6 6 6 1 1 1 1 1 1 1 1 1 1
symmnumber: 1
zpe: 438916.0 jmol-1
zpe.correction: 0.167174 hartree
zpe.thermalcorrener: 0.177673 hartree
zpe.thermalcorrenthalpy: 0.178618 hartree
zpe.thermalcorrgfe: 0.130761 hartree
zpe.sumelectzpe: -498.617860 hartree
zpe.sumelectthermal: -498.607361 hartree
zpe.sumelectthermalent: -498.606417 hartree
zpe.sumelectthermalfe: -498.654273 hartree
dipole: 1.6083 0.8851 0.0050
dipole: 1.8358
quadrupole: -55.1010 -63.7016 -67.2076
quadrupole: -3.7980 -0.0063 -0.0204
quadrupole: 6.9024 -1.6982 -5.2042 -3.7980 -0.0063 -0.0204
hfenergy: -498.7850346 hartree
pointgroup: C01 [X(C9H10O2)]
dipole: -0.6603762 0.2918891 0.0184594 debye
dipolederiv: -0.9548943 -0.5046064 -0.0163465 -0.6317372 -0.7447656 -0.0071729 -0.0215375 -0.0083844 -0.4315145 -0.8668622 0.2745853 0.0175063 0.2072912 -0.9049787 -0.0278897 0.0148617 -0.0287107 -0.3123966 0.0836543 -0.3401403 -0.0171357 0.0658463 0.3282643 0.0171006 0.00108 0.0218142 -0.0247427 0.1327766 0.4069728 0.017138 0.303808 -0.0829551 -0.0058149 0.0133642 -0.0063146 -0.0367591 -0.696657 0.0874441 0.011161 0.2129995 -0.1253658 -0.0076578 0.0169296 -0.0065753 -0.0124869 0.0987151 -0.0099442 -0.0028886 -0.0687723 0.063908 0.0103906 -0.0057622 0.0096898 -0.1445838 0.054902 0.1907633 0.0094943 0.0555283 -0.2032653 -0.0114811 0.0034422 -0.0124215 0.023361 0.1181059 0.0711951 0.0005706 -0.2149699 -0.0631571 0.0050347 -0.012081 0.0022005 -0.1274162 -0.0148494 -0.0988177 -0.0038854 -0.1484724 -0.055475 -0.0035478 -0.0081185 -0.0057547 0.0636227 -0.2412891 -0.1414267 -0.0057921 -0.0801648 0.0953072 0.0125177 -0.0029031 0.0130261 -0.1601774 1.9724806 0.0428982 -0.0163253 0.108157 1.3354555 0.0472116 -0.0137952 0.0480738 0.21625 -0.1211332 0.0653166 0.0060323 0.0355141 0.0785426 -0.0033038 0.0051187 -0.0035718 0.1445129 -0.0628741 -0.1765123 -0.0079472 -0.0841011 0.0019979 -0.0039183 -0.0034401 -0.0033653 0.0941199 0.0572056 0.0245221 0.0859767 0.0035888 0.0530454 -0.0116777 0.0813844 -0.0417661 -0.0203643 0.0553089 0.0339532 -0.0839591 0.0123486 0.046761 0.0188508 -0.0817981 0.0481361 -0.011618 0.0691679 -0.0718551 -0.002352 -0.0678296 0.0425886 -0.0047903 -0.0024382 -0.0044525 0.1610202 0.0550986 -0.0236326 0.0302419 -0.0573705 0.0060495 -0.1016602 -0.0230222 -0.1155262 -0.0524788 0.0552386 -0.0141791 -0.0369423 -0.0542106 -0.017856 0.1072062 0.0132833 0.1197042 -0.0272486 -0.0997481 0.0439615 0.0067918 0.1670395 0.0261145 -0.0076743 0.0128278 -0.0048703 0.1066559 0.0652604 0.043719 0.0030224 0.0505537 -0.1156055 -0.0130415 0.0033501 -0.0131057 0.158944 0.2403927 0.0957832 0.0056387 0.1849534 0.2353895 -0.0086822 0.0092542 -0.0078258 0.3933004 unknown
polarizability: 137.4459578|-1.7990231|120.2833824|-0.9885343|3.1973622|51.009965 unknown
InChI: InChI=1S/C9H10O2/c1-6-4-3-5-8(7(6)2)9(10)11/h3-5,10H,1-2H3
charge 0 multiplicity 1
21 atoms
O  2.918465 0.994507 -0.026302
O  2.550763 -1.283603 -0.121437
C  -0.410881 -0.739919 -0.070152
C  -1.773307 -0.303056 -0.034123
C  0.622307 0.256914 -0.034536
C  -2.064897 1.082396 0.032208
C  -0.088155 -2.222115 -0.146152
C  0.299614 1.640989 0.032079
C  -2.931473 -1.289421 -0.065372
C  -1.041376 2.054337 0.064864
C  2.059946 -0.126708 -0.066001
H  -3.114111 1.400824 0.058661
H  -1.000651 -2.835605 -0.17051
H  0.518364 -2.453308 -1.039463
H  0.530787 -2.542109 0.710484
H  1.113612 2.368876 0.056908
H  -2.932369 -1.896297 -0.990197
H  -2.896577 -1.994812 0.785646
H  -3.895973 -0.756472 -0.016465
H  -1.291246 3.119152 0.116034
H  3.854558 0.659229 -0.049974
