program: Gaussian 09
title: 000136619
version: EM64L-G09RevD.01
frameworkgroup: C1[X(C8H3F7)]
method: RPBEPBE
basis: SDD
operation: Freq
keyword: #p
keyword: freq=noraman
keyword: PBEPBE/SDD
title: #p freq=noraman PBEPBE/SDD
converged: NO NO NO NO
title: Mulliken charges:
elementType: F F F F F F F C C C C C C C C H H H
charge: -0.132590 -0.137136 -0.155658 -0.154593 -0.136567 -0.149011 -0.149250 0.020727 0.219433 0.056210 0.186230 0.100164 0.095877 0.318680 -0.755044 0.259544 0.256357 0.256624
chargesum: 0.00000
title: Mulliken charges with hydrogens summed into heavy atoms:
elementType: F F F F F F F C C C C C C C C
charge: -0.132590 -0.137136 -0.155658 -0.154593 -0.136567 -0.149011 -0.149250 0.020727 0.219433 0.056210 0.186230 0.100164 0.095877 0.318680 0.017482
polarizability: 1.18380802e+02 1.23576014e-01 1.00114192e+02 7.69900156e-01 -2.64638226e-02 4.76170794e+01
1716.lowfreq: -21.9189 -0.0008 -0.0005 -0.0003 7.0181 7.5239 14.4927 33.5692 70.4843
frequency: -19.2118 33.3798 70.4809 117.7420 146.8583 154.8363 182.1191 254.2653 254.7560 263.0480 279.6386 280.6318 308.5166 341.7296 382.1986 394.0620 427.1959 471.5454 473.3167 489.4676 553.8961 626.1145 635.5738 649.1794 702.8078 756.0558 804.5238 877.7865 989.6935 998.2829 1032.7098 1043.6920 1051.3351 1085.8243 1154.4898 1262.4838 1357.7815 1377.3623 1406.6901 1431.0880 1457.5211 1464.4094 1474.0648 1589.7739 1632.8914 2998.8020 3085.9635 3122.1004
redmass: 1.0311 16.4266 7.9818 18.2183 5.8593 15.0109 10.4617 13.4772 10.7832 3.5390 16.0901 11.7423 15.9830 10.7411 11.2921 11.3800 14.2980 15.6252 17.3548 11.0014 7.5506 17.0073 7.3317 11.2997 6.1681 9.2695 12.7142 5.1776 9.1553 12.8713 6.3346 1.5179 3.2188 3.7987 9.9708 11.0011 10.3115 8.0788 1.3336 3.5879 1.7326 1.7165 1.5379 7.9905 11.4405 1.0395 1.0939 1.1013
irintensity: 0.3693 0.1118 0.0696 0.0080 3.9932 0.2884 0.7168 0.2934 0.0511 1.3333 0.5014 1.2060 0.1867 7.5988 1.0215 0.7846 0.5064 1.6596 1.5940 0.0055 1.6702 31.7412 1.1450 0.2113 1.3256 0.4880 71.6302 125.2833 23.2833 262.1348 3.0150 10.1903 136.7613 11.5796 95.7715 303.3080 25.6590 29.0380 3.3353 213.6145 10.8007 20.1622 142.4131 0.2715 45.9569 3.1407 6.6548 2.0473
temp: 298.150 k
press: 1.00000 atm
elementType: 9 9 9 9 9 9 9 6 6 6 6 6 6 6 6 1 1 1
symmnumber: 1
zpe: 250908.9 jmol-1
zpe.correction: 0.095566 hartree
zpe.thermalcorrener: 0.108616 hartree
zpe.thermalcorrenthalpy: 0.109561 hartree
zpe.thermalcorrgfe: 0.055401 hartree
zpe.sumelectzpe: -1004.427345 hartree
zpe.sumelectthermal: -1004.414295 hartree
zpe.sumelectthermalent: -1004.413350 hartree
zpe.sumelectthermalfe: -1004.467510 hartree
dipole: 4.3729 0.0707 0.0674
dipole: 4.3740
quadrupole: -79.6575 -93.5014 -80.7836
quadrupole: -1.1318 0.2665 -0.0071
quadrupole: 4.9900 -8.8539 3.8639 -1.1318 0.2665 -0.0071
hfenergy: -1004.522911 hartree
pointgroup: C01 [X(C8H3F7)]
dipole: -1.7192155 0.0724185 -0.0217768 debye
dipolederiv: -0.3280639 -0.304913 0.0007746 -0.305726 -0.7808661 0.0005513 0.0010807 0.0005606 -0.0936267 -0.3686847 0.328785 0.0008599 0.3268196 -0.7384195 -0.0003235 0.0011836 -0.0004375 -0.0888235 -0.3782134 0.3377564 0.0020594 0.3377701 -0.7521387 -0.0043236 0.0022569 0.0001202 -0.1072408 -0.364481 -0.3231517 0.0025034 -0.335137 -0.7649379 0.0049674 0.002612 0.0004552 -0.1051084 -0.535939 -0.236538 0.0001974 -0.1954472 -0.6156599 0.0001855 0.0011746 0.0010721 -0.2721602 -0.6201885 0.1060594 -0.1698434 0.1612739 -0.3587972 0.2029091 -0.1844756 0.1831985 -0.6234196 -0.6174845 0.1043853 0.1666638 0.1596868 -0.3588687 -0.2027128 0.1848955 -0.1842374 -0.6255065 -0.6512262 0.0043354 -0.0052774 -0.0239977 -0.2060017 -0.000276 0.0033747 -0.0002332 -0.1920624 0.3569027 0.0056787 0.0177175 0.0072913 -0.0813085 0.000402 0.053157 0.0008219 -0.0257004 0.5012044 0.5369945 0.0036277 0.1582751 0.8495115 0.0031064 -0.0038015 -0.0019478 0.1179054 0.5139842 -0.5494725 0.0037021 -0.2105942 0.7839187 -0.0029006 -0.0041911 0.0020257 0.1171774 0.168339 -0.5838985 0.0004817 -0.4371595 0.7567031 -0.0003551 -0.0015297 -0.0039408 0.0635124 0.1582675 0.5645267 -0.0002135 0.427523 0.7886716 -0.0007046 -0.0015921 0.0029987 0.0594654 2.1845004 0.0112119 0.0030865 -0.068927 1.3244188 -0.0002422 -0.0026986 0.000119 1.5967398 -0.1786845 -0.0015833 -0.020093 -0.0021428 0.0186804 -0.0003827 -0.1163304 -0.0015709 0.0522615 0.0303577 -0.0012499 -0.0277326 -0.0009693 0.1281354 -0.0007046 -0.0441887 -0.0010307 -0.0509428 0.0652848 -0.009877 0.0098112 -0.0492775 0.0028353 0.0828367 0.0540073 0.0613053 0.0884535 0.0641248 0.0109507 0.0116748 0.0507383 0.0041234 -0.0820327 0.0550653 -0.059279 0.0890759 unknown
polarizability: 118.3658135|-0.596901|100.1328932|0.5752796|-0.0089509|47.6133668 unknown
InChI: InChI=1S/C8H3F7/c1-2-4(9)6(11)3(8(13,14)15)7(12)5(2)10/h1H3
charge 0 multiplicity 1
18 atoms
F  0.624448 2.490547 0.002322
F  0.714535 -2.382856 0.003264
F  -2.085573 2.420211 0.01239
F  -2.028096 -2.411451 0.014432
F  2.897939 1.238604 -0.00891
F  2.772075 -0.713432 1.126708
F  2.762075 -0.712984 -1.143759
C  0.765039 0.045014 0.000934
C  -2.130624 0.005126 0.010282
C  0.014173 1.243035 0.003829
C  0.035981 -1.169876 0.004558
C  -1.396403 1.207403 0.009069
C  -1.369638 -1.182519 0.009991
C  2.277016 -0.019221 -0.006063
C  -3.641551 -0.011052 0.002412
H  -4.024222 -0.017199 -1.035368
H  -4.025838 -0.913424 0.504119
H  -4.045536 0.884372 0.50089
