program: Gaussian 09
title: 000136612
version: EM64L-G09RevD.01
frameworkgroup: C1[X(C10H15N)]
method: RPBEPBE
basis: SDD
operation: Freq
keyword: #pfreq=noraman
keyword: PBEPBE/SDD
title: #p freq=noraman PBEPBE/SDD
converged: YES YES NO NO
title: Mulliken charges:
elementType: N C C C C C C C C C C H H H H H H H H H H H H H H H
charge: -0.188912 0.261329 0.332762 0.466437 -0.537276 -0.331989 -0.447896 -0.834319 -0.655278 -0.640719 -0.816477 0.227995 0.233085 0.224680 0.217854 0.249535 0.225294 0.195259 0.223887 0.244534 0.206920 0.250743 0.219039 0.222737 0.221418 0.229357
chargesum: 0.00000
title: Mulliken charges with hydrogens summed into heavy atoms:
elementType: N C C C C C C C C C C
charge: -0.188912 0.261329 0.332762 0.466437 -0.309281 -0.098905 -0.223216 -0.141636 0.008401 0.035983 -0.142964
polarizability: 1.60943134e+02 1.87185526e-01 1.19996327e+02 -4.26486073e-01 -2.30732889e+00 7.03574687e+01
1716.lowfreq: -29.5460 -11.8073 -0.0006 -0.0004 0.0003 5.8552 9.6711 85.4920 95.1745
frequency: -27.6967 85.4695 95.1570 139.8790 191.9460 209.6523 218.7516 231.6308 279.2581 284.4266 327.1838 348.7291 388.5952 454.3427 469.9785 491.0289 562.2280 572.6212 669.9691 716.0341 736.5696 818.9568 887.1459 914.8191 941.8490 950.4728 976.0948 1018.6048 1040.5490 1046.8561 1049.4420 1087.8605 1111.9054 1134.6050 1158.7653 1182.6243 1202.3886 1249.1450 1293.7319 1330.6251 1364.9068 1390.9122 1395.0033 1406.8506 1422.8317 1443.0611 1459.6169 1468.2354 1469.3853 1470.7733 1474.8620 1478.0813 1491.6154 1493.8078 1513.0920 1576.8696 1623.6264 2881.7966 2897.5046 2962.5830 2969.2047 3019.5147 3021.0229 3042.7144 3046.8150 3077.8137 3082.1738 3088.1843 3101.0659 3115.5798 3117.2503 3150.3668
redmass: 1.0262 2.8001 3.0375 1.2677 2.4066 1.1561 1.9912 2.4621 1.3086 1.9811 3.0520 2.9174 3.2772 2.9718 3.2003 3.3774 4.4066 2.9768 4.0584 5.4505 3.1630 1.4476 1.2955 2.9918 1.3539 3.6396 1.4628 1.5138 1.4960 1.5171 1.5182 1.2438 2.2553 1.4264 1.7543 1.5454 2.5238 2.9725 1.4945 3.3397 5.6311 1.2586 1.2423 2.7905 1.1508 1.2346 1.0625 1.0620 1.0814 1.0512 1.1031 1.1019 1.1883 1.1747 1.7697 6.0510 6.2178 1.0547 1.0552 1.0403 1.0379 1.0765 1.0814 1.0918 1.0962 1.0989 1.1000 1.0995 1.0910 1.0885 1.0947 1.0942
irintensity: 0.3963 2.6443 1.8315 1.6459 6.0114 0.5419 2.5637 1.1213 1.3405 0.7360 0.5255 5.4364 2.8040 4.0820 5.3425 1.0075 1.1228 9.5444 3.3827 0.1659 0.5961 41.4380 4.4819 11.6305 1.4540 20.5681 5.5215 2.0268 2.4376 5.6213 25.8747 10.7257 55.1552 19.5194 12.8720 7.2337 16.3904 4.5697 1.1538 46.3916 1.4777 15.2952 4.1834 4.0432 4.4675 2.1564 7.2711 11.9912 41.3966 16.6767 20.0376 22.9384 2.2511 7.8676 119.5023 0.1585 10.6624 93.8514 175.5297 46.4384 51.9547 61.9621 35.3993 25.9745 27.0670 19.1019 12.5805 28.8616 30.5368 19.2251 18.5394 19.5935
temp: 298.150 k
press: 1.00000 atm
elementType: 7 6 6 6 6 6 6 6 6 6 6 1 1 1 1 1 1 1 1 1 1 1 1 1 1 1
symmnumber: 1
zpe: 588485.0 jmol-1
zpe.correction: 0.224142 hartree
zpe.thermalcorrener: 0.235389 hartree
zpe.thermalcorrenthalpy: 0.236333 hartree
zpe.thermalcorrgfe: 0.187960 hartree
zpe.sumelectzpe: -443.962727 hartree
zpe.sumelectthermal: -443.951481 hartree
zpe.sumelectthermalent: -443.950536 hartree
zpe.sumelectthermalfe: -443.998910 hartree
dipole: 0.9747 -0.0811 0.4993
dipole: 1.0981
quadrupole: -59.8188 -62.6523 -70.8997
quadrupole: -1.3525 0.9230 0.5343
quadrupole: 4.6381 1.8047 -6.4428 -1.3525 0.9230 0.5343
hfenergy: -444.1868695 hartree
pointgroup: C01 [X(C10H15N1)]
dipole: 0.3851065 0.1061136 -0.1645652 debye
dipolederiv: -1.2326159 -0.1209939 0.0259911 0.2121185 -0.4560949 0.0092975 -0.0988935 -0.0389284 -0.4410246 1.2364869 0.0888685 0.0303909 0.0664057 -0.0412987 -0.0953867 0.0576856 -0.0590763 -0.0943119 -0.2035749 -0.0685188 -0.0083354 -0.2833515 0.1904257 0.0661632 -0.2199294 0.0879635 -0.0394364 0.2433607 -0.0110972 0.0240371 0.0452747 -0.1262916 -0.0275533 0.1109116 -0.0198409 -0.0438572 -0.0198529 0.0397453 0.0162281 0.0803384 0.0294626 0.0820386 0.027958 0.0835394 -0.1601739 -0.2452059 -0.0906272 -0.0082896 0.1948226 0.0050437 0.0859863 0.207862 0.0634641 -0.14789 -0.0458142 0.0685447 0.0316605 -0.1114382 0.068052 0.0752987 -0.0179763 0.0905683 -0.1568104 -0.0199764 0.0494226 -0.0182641 0.0805337 -0.0608155 -0.0299919 -0.0112398 -0.0724956 0.0675988 0.2197757 0.106554 0.125766 0.3083943 0.4590045 0.0375046 0.2304263 0.0521043 0.2363901 0.3717841 -0.0392747 -0.2079621 -0.2809339 0.226908 -0.0990045 -0.3215587 -0.1321575 0.3692453 -0.0766314 -0.0009236 -0.0130353 -0.0230753 0.0840592 0.0022539 -0.099378 -0.0050072 0.0772049 0.0220963 -0.0864947 -0.0332327 -0.1085066 -0.065206 -0.0658405 -0.0187478 -0.0627165 0.1167874 0.0304194 -0.0932756 -0.0375294 -0.092949 -0.0438467 -0.0712078 -0.0279053 -0.0605119 0.1276526 0.0033128 0.1043193 0.0308983 0.1115212 -0.0539801 -0.0629125 0.0146404 -0.0766693 0.1264852 0.0625477 0.0729742 0.0875228 0.0409012 0.0341639 -0.0062656 0.1108244 -0.0677992 -0.1369727 -0.0443935 0.0868857 -0.0750863 0.019988 0.0999712 -0.0154481 -0.0928085 0.0406223 0.0394289 -0.0109168 -0.1620546 0.0350223 -0.0580021 -0.0810797 0.0185941 0.0317553 0.047583 0.0957285 0.0441384 -0.0023003 -0.0349438 -0.1722478 -0.2649165 -0.0027664 -0.0081096 0.12147 -0.0123456 -0.2181552 0.0164706 -0.097414 0.0724628 0.0460697 0.0103627 -0.0354198 0.0045299 0.1059301 0.080022 0.0172422 0.14164 -0.028732 0.0560189 -0.0300696 0.0717228 -0.018139 -0.0846097 -0.0165271 0.0194345 0.0600375 -0.1236878 -0.1457098 0.2081342 0.1897118 0.0783531 -0.0798548 0.0955667 -0.0710048 -0.0753887 -0.0336004 0.000284 -0.1118105 -0.0502408 -0.0850639 -0.0083149 -0.2122177 0.0796445 0.0156785 0.0733105 0.0718118 0.032495 -0.0672142 0.0374486 0.0495497 -0.0254861 -0.0410718 0.0233209 -0.1328517 -0.0788546 0.0845183 0.0695553 0.065686 0.0728232 0.0175358 0.0298021 0.0177729 0.125958 -0.059905 -0.1043505 0.0845252 -0.0976279 0.0422466 -0.0556785 0.007729 -0.0564853 0.0173467 0.106724 0.0099607 -0.138157 0.0227012 -0.1214692 unknown
polarizability: 160.9276228|-0.4363739|114.200416|1.2186462|16.1024834|76.1688911 unknown
InChI: InChI=1S/C10H15N/c1-8-5-6-10(11(3)4)9(2)7-8/h5-7H,1-4H3
charge 0 multiplicity 1
26 atoms
N  2.109319 0.060187 0.268741
C  0.677738 0.089896 0.174028
C  -0.048066 -1.083023 -0.225339
C  -2.197712 0.145497 0.046803
C  -1.459379 -1.018455 -0.288372
C  -0.058182 1.252255 0.535742
C  -1.467816 1.277324 0.479522
C  0.654968 -2.400473 -0.502236
C  2.754529 1.030599 1.167094
C  2.874795 -0.145883 -0.978616
C  -3.713896 0.16665 -0.051891
H  -2.00615 -1.924977 -0.58291
H  0.475758 2.153188 0.855424
H  -2.002693 2.19138 0.766431
H  0.960592 -2.506803 -1.56255
H  1.567507 -2.486687 0.114468
H  -0.010903 -3.250923 -0.273449
H  2.804745 2.065638 0.750065
H  3.791954 0.701038 1.36181
H  2.218821 1.069394 2.130245
H  2.961852 0.792884 -1.57551
H  2.390859 -0.902127 -1.613183
H  3.895842 -0.497388 -0.739167
H  -4.161272 -0.756501 0.361021
H  -4.141448 1.024154 0.496764
H  -4.04896 0.246957 -1.104637
