program: Gaussian 09
title: 000136598
version: EM64L-G09RevD.01
frameworkgroup: C1[X(C9H8)]
method: RPBEPBE
basis: SDD
operation: Freq
keyword: #p
keyword: freq=noraman
keyword: PBEPBE/SDD
title: #p freq=noraman PBEPBE/SDD
converged: YES YES NO NO
title: Mulliken charges:
elementType: C C C C C C C C C H H H H H H H H
charge: 0.313687 0.160617 -0.410949 -0.808351 -0.371650 -0.226365 -0.229958 0.135757 -0.490854 0.233754 0.240718 0.223716 0.240745 0.248514 0.228820 0.231540 0.280258
chargesum: 0.00000
title: Mulliken charges with hydrogens summed into heavy atoms:
elementType: C C C C C C C C C
charge: 0.313687 0.160617 -0.177194 -0.103172 -0.123135 0.002455 0.001583 0.135757 -0.210597
polarizability: 1.46326630e+02 4.73121312e+00 9.54477394e+01 3.10949643e-02 9.37862990e-03 4.24627569e+01
1716.lowfreq: -13.6954 -10.4279 -0.0006 -0.0005 -0.0004 9.1490 88.1215 130.4802 134.6526
frequency: 88.1043 130.4789 134.6487 213.5526 329.2131 370.0773 445.5874 460.4053 526.2237 561.7149 572.5334 610.2937 645.8187 713.2655 727.8408 772.0323 813.2477 878.5385 954.8680 987.1826 991.5866 1043.1629 1045.9155 1106.5897 1175.0622 1189.4537 1225.8333 1282.5968 1363.5339 1401.4469 1427.0599 1462.2091 1472.8663 1478.5274 1572.6941 1609.0130 2124.6142 2981.4283 3059.2268 3091.5310 3124.7176 3137.1388 3150.7444 3167.6576 3429.4143
redmass: 1.0492 3.4470 3.7563 3.1778 2.9646 3.9609 6.2388 2.9393 5.3591 4.1165 6.2800 1.2360 1.2328 5.0755 2.4032 1.4409 4.8710 1.3111 1.3867 1.6011 1.3316 2.1855 1.5541 2.0106 1.0599 2.4964 2.6133 1.4763 7.2859 1.2466 1.9665 1.0446 1.5203 1.7419 6.3303 6.0473 6.2742 1.0371 1.0969 1.0995 1.0861 1.0890 1.0946 1.1008 1.1551
irintensity: 0.6850 0.6392 0.6311 6.3030 2.0970 0.8899 2.0711 6.4579 1.4398 2.5946 0.1716 68.9380 64.9901 1.7423 12.1405 78.4211 1.2151 0.8907 1.7012 1.3686 0.0005 8.2782 8.8711 8.4976 0.3968 0.8311 0.0592 0.7731 0.8101 15.5602 2.2587 13.9238 17.7540 22.9828 0.2452 2.5164 9.3953 19.7361 16.3676 20.0149 4.7713 8.3629 28.0593 23.5364 85.6453
temp: 298.150 k
press: 1.00000 atm
elementType: 6 6 6 6 6 6 6 6 6 1 1 1 1 1 1 1 1
symmnumber: 1
zpe: 353195.3 jmol-1
zpe.correction: 0.134525 hartree
zpe.thermalcorrener: 0.142851 hartree
zpe.thermalcorrenthalpy: 0.143795 hartree
zpe.thermalcorrgfe: 0.101618 hartree
zpe.sumelectzpe: -347.073159 hartree
zpe.sumelectthermal: -347.064833 hartree
zpe.sumelectthermalent: -347.063889 hartree
zpe.sumelectthermalfe: -347.106066 hartree
dipole: 0.4072 0.4993 0.0047
dipole: 0.6443
quadrupole: -44.1719 -47.6174 -57.3252
quadrupole: -0.1051 -0.0174 -0.0037
quadrupole: 5.5329 2.0874 -7.6204 -0.1051 -0.0174 -0.0037
hfenergy: -347.2076837 hartree
pointgroup: C01[X(C9H8)]
dipole: -0.1736775 -0.1846305 0.0018305 debye
dipolederiv: 0.038936 -0.2571857 0.0000545 -0.1308192 0.2429121 -0.0000949 0.0001424 -0.000077 -0.0181691 0.2102061 0.0358171 0.0000185 0.117343 -0.0451677 -0.0000171 -0.0001087 -0.0000031 -0.0058409 -0.0936455 0.2103465 -0.0000604 0.1142182 -0.0002778 -0.0000772 -0.0000501 -0.0000825 -0.1731867 -0.0466054 0.1840056 -0.0000006 0.1233498 -0.0332343 0.000005 -0.0000132 0.0001612 0.05495 -0.0288669 0.0674091 -0.0000696 -0.0209593 0.0528812 0.0000232 0.0000607 -0.0000303 -0.1451523 0.0643175 0.0003705 -0.000012 0.032374 0.0267435 -0.0000289 -0.0000477 -0.000006 -0.1457152 -0.0638358 -0.1189143 -0.000014 -0.125819 0.0027644 0.0000598 -0.0000258 0.000043 -0.1643334 0.3237435 0.067776 -0.0005101 0.0120368 -0.0851115 -0.0000204 -0.0016227 -0.0002078 0.0013484 -0.6559087 -0.0645543 0.000754 -0.0372147 -0.3075541 0.0000567 0.0030951 0.0003959 -0.3429537 0.0419676 -0.0603297 0.0000356 -0.0979031 -0.0954742 0.0000436 0.0000228 0.000033 0.1545626 0.0259128 0.0474908 -0.106649 0.0207382 0.0490827 -0.0245728 -0.1016522 0.0302453 -0.032933 -0.0017645 -0.1670323 -0.0000913 -0.064582 -0.0824246 -0.0000812 -0.0000283 -0.0001048 0.1070716 0.0257894 0.0474029 0.1066829 0.0206259 0.0491513 0.0246882 0.1016556 -0.0301889 -0.0326998 0.0580245 -0.0795179 0.0000345 -0.0576734 -0.055764 0.0000252 0.0000398 0.0000289 0.1556815 -0.135448 -0.0096689 0.0000704 -0.0176941 0.0845103 0.0000097 0.0000767 0.000004 0.1590815 0.0008718 0.0945366 0.000027 0.1106823 -0.055232 -0.0000078 0.0000211 -0.0000158 0.1638711 0.2363056 0.002048 -0.0002701 0.0012967 0.2521945 -0.000011 -0.0015655 -0.000195 0.2644174 unknown
polarizability: 146.7394488|1.1000796|95.0349202|-0.0316796|-0.0071594|42.4627569 unknown
InChI: InChI=1S/C9H8/c1-3-9-7-5-4-6-8(9)2/h1,4-7H,2H3
charge 0 multiplicity 1
17 atoms
C  -0.155742 -0.979847 -0.000055
C  0.452244 0.318731 -0.000305
C  -1.568788 -1.058255 0.000276
C  0.697329 -2.233552 -0.00009
C  -0.363756 1.486307 -0.000225
C  -2.374443 0.103802 0.000365
C  -1.76875 1.381389 0.000107
C  1.883621 0.451179 -0.000644
C  3.115223 0.554171 -0.000811
H  -2.043806 -2.04627 0.000465
H  1.358235 -2.267778 0.885982
H  0.071894 -3.142017 -0.000574
H  1.358932 -2.267261 -0.885649
H  0.119962 2.468599 -0.000429
H  -3.466219 0.012011 0.000627
H  -2.386298 2.285932 0.000169
H  4.184962 0.653061 0.002391
