program: Gaussian 09
title: 000136596
version: EM64L-G09RevD.01
frameworkgroup: C1[X(C9H12)]
method: RPBEPBE
basis: SDD
operation: Freq
keyword: #p
keyword: freq=noraman
keyword: PBEPBE/SDD
title: #p freq=noraman PBEPBE/SDD
converged: YES YES NO NO
title: Mulliken charges:
elementType: C C C C C C C C C H H H H H H H H H H H H
charge: 0.246422 -0.472456 -0.472734 -0.440856 -0.440493 -0.332158 -0.282794 -0.254278 -0.279464 0.205199 0.241138 0.241076 0.205320 0.209191 0.226772 0.226735 0.209198 0.245929 0.248885 0.234887 0.234483
chargesum: 0.00000
title: Mulliken charges with hydrogens summed into heavy atoms:
elementType: C C C C C C C C C
charge: 0.246422 -0.026120 -0.026338 -0.004893 -0.004560 -0.086229 -0.033910 -0.019391 -0.044980
polarizability: 1.12917896e+02 -1.54689106e+00 8.49011494e+01 3.19565346e-03 -3.22582793e-02 6.66231836e+01
1716.lowfreq: -16.2224 -13.9089 -0.0007 -0.0006 -0.0005 11.5312 73.4609 131.2042 147.2995
frequency: 73.3506 131.2025 147.2585 220.4420 342.7651 421.7317 516.4497 563.2883 629.9172 656.0508 733.1612 744.0939 785.0862 803.6843 812.1123 843.4182 880.9787 920.6871 930.5991 936.1941 947.1284 984.2144 1019.5264 1029.2408 1053.8411 1068.6340 1072.3585 1086.4219 1138.1364 1183.8055 1203.3241 1219.8330 1232.2848 1270.0248 1274.4266 1296.6204 1299.0685 1313.7287 1368.7339 1458.3669 1468.4646 1468.6793 1488.2676 1515.4409 1580.9015 2989.9636 2995.1344 2996.4131 3012.4136 3043.5337 3063.7263 3071.5631 3083.1022 3146.5641 3155.0374 3174.1281 3191.5043
redmass: 1.6771 3.2827 2.6674 2.3523 2.0923 4.2891 2.6446 2.7478 2.3996 1.9793 1.3940 1.2867 1.9233 3.3611 1.5996 3.5999 2.6375 1.8746 1.3163 1.3914 2.2936 1.9774 1.8947 1.5877 2.0673 1.4186 4.6194 1.0904 1.4747 1.3538 1.7716 1.1650 1.7126 1.2538 1.3188 1.3783 1.4661 1.6818 2.0565 1.0793 1.0831 1.0907 1.1187 5.9901 5.6642 1.0613 1.0621 1.0618 1.0651 1.1013 1.1006 1.1022 1.1047 1.0852 1.0888 1.1031 1.1107
irintensity: 0.0076 1.5128 0.0503 0.3692 0.7879 0.9262 3.8991 0.1587 0.8611 1.9529 0.7896 120.4789 4.1858 5.6954 0.5403 6.0549 1.8992 11.1131 0.2772 0.0751 14.1055 11.4524 3.3905 2.1531 3.8042 6.0063 3.5346 9.5811 3.5952 0.2880 0.1441 0.6100 1.9854 0.7150 0.1338 1.3440 1.6410 1.6690 4.6079 3.9257 7.0145 9.4253 3.9631 9.9058 0.0570 8.1990 43.5166 49.7953 51.2137 12.5623 9.4677 24.0765 78.5201 0.3827 9.9953 30.4000 13.3560
temp: 298.150 k
press: 1.00000 atm
elementType: 6 6 6 6 6 6 6 6 6 1 1 1 1 1 1 1 1 1 1 1 1
symmnumber: 1
zpe: 478847.4 jmol-1
zpe.correction: 0.182383 hartree
zpe.thermalcorrener: 0.190332 hartree
zpe.thermalcorrenthalpy: 0.191276 hartree
zpe.thermalcorrgfe: 0.149767 hartree
zpe.sumelectzpe: -349.438164 hartree
zpe.sumelectthermal: -349.430215 hartree
zpe.sumelectthermalent: -349.429271 hartree
zpe.sumelectthermalfe: -349.470780 hartree
dipole: 0.8834 -0.1548 0.0001
dipole: 0.8968
quadrupole: -52.5834 -51.7909 -57.4198
quadrupole: -0.5013 0.0010 -0.0111
quadrupole: 1.3480 2.1405 -3.4884 -0.5013 0.0010 -0.0111
hfenergy: -349.6205471 hartree
pointgroup: C01 [X(C9H12)]
dipole: -0.3481458 -0.0573722 -0.0001383 debye
dipolederiv: -0.351016 -0.0355038 -0.0001832 -0.0253681 -0.0754238 -0.0005385 -0.0001157 -0.0005173 0.0652137 0.1432611 0.0441054 0.0204711 0.0424435 0.1531735 0.0033335 0.1089532 -0.0118429 0.1067148 0.1431019 0.0441235 -0.0200239 0.0431041 0.1531093 -0.002946 -0.1085488 0.0121835 0.1067862 0.0442649 0.059883 0.0085421 0.0106114 0.1139918 -0.044282 -0.0382376 -0.020186 0.0066655 0.0443439 0.0597631 -0.0081209 0.0103643 0.1135026 0.0451684 0.0383096 0.0212199 0.0070406 0.2012862 -0.0242035 -0.0000843 -0.0521929 -0.0746299 0.0007449 -0.0002155 0.0007468 -0.2758654 0.0991343 0.0964338 0.000322 0.1702124 -0.0663399 0.0007958 0.000587 0.0008016 -0.2711062 -0.0412244 -0.1537889 -0.000593 -0.2120587 0.0410575 0.0008906 -0.0007897 0.0008869 -0.1905691 -0.1590584 0.0852845 0.0003468 0.1182848 0.1702188 0.0013741 0.0004416 0.0013625 -0.1884417 -0.0133615 -0.0205583 -0.0308872 -0.0396208 -0.1610865 -0.0608297 -0.02173 0.0001581 0.0635223 0.0298871 -0.008842 0.0902794 -0.0038018 0.0524508 0.0712071 0.0611325 0.0288848 -0.119855 0.0298921 -0.0081823 -0.0902349 -0.0033496 0.0531281 -0.0700118 -0.0611567 -0.0276348 -0.1205567 -0.0133034 -0.0206352 0.0306557 -0.0396333 -0.1614894 0.0592576 0.0213937 -0.0017641 0.0639312 -0.1504941 -0.0604213 -0.105375 -0.0847186 0.0415217 -0.0498071 -0.0699984 -0.0317017 0.0141412 0.0713464 -0.0169032 0.0180088 0.0520585 -0.1403072 0.0955659 -0.0046211 0.0583471 0.0065316 0.0711357 -0.0162547 -0.0178545 0.0525475 -0.138808 -0.0969554 0.00539 -0.0598494 0.0051004 -0.1503326 -0.0616066 0.1045712 -0.0857336 0.0404478 0.0501673 0.0689836 0.0320308 0.0150476 0.0780922 -0.0332427 -0.000126 0.0118676 -0.0913227 -0.0009633 0.0000529 -0.000941 0.1630832 0.0447728 0.096653 0.0003875 0.0699004 -0.0401204 -0.0007665 0.0003195 -0.00078 0.1598194 -0.1108471 0.0838537 0.0003191 0.0778403 0.0586502 -0.0005106 0.0002822 -0.0005118 0.1921938 -0.0108812 -0.1099574 -0.0004209 -0.1127575 -0.0417245 -0.0008944 -0.0004321 -0.0008929 0.1906025 unknown
polarizability: 112.9464943|1.2612783|84.872355|0.0040066|0.0679738|66.6233798 unknown
InChI: InChI=1S/C9H12/c1-2-6-9(5-1)7-3-4-8-9/h1-2,5-6H,3-4,7-8H2
charge 0 multiplicity 1
21 atoms
C  0.038751 -0.241032 -0.000917
C  -0.940941 -0.440982 -1.20874
C  -0.940938 -0.450355 1.20535
C  -2.247653 0.291087 -0.782859
C  -2.2483 0.283883 0.784934
C  1.246612 -1.161834 -0.004467
C  0.683375 1.142464 0.004382
C  2.403058 -0.421773 -0.001648
C  2.050037 1.017682 0.003891
H  -1.130031 -1.524851 -1.332138
H  -0.517387 -0.063273 -2.155312
H  -0.517655 -0.079213 2.154633
H  -1.129225 -1.535214 1.320941
H  -3.140419 -0.207046 -1.201881
H  -2.247554 1.328221 -1.164491
H  -2.250321 1.317405 1.176245
H  -3.140676 -0.219537 1.198453
H  1.163678 -2.252765 -0.008609
H  0.111735 2.074693 0.008029
H  3.424744 -0.812177 -0.003136
H  2.775809 1.836017 0.00704
