program: Gaussian 09
title: 000136563
version: EM64L-G09RevD.01
frameworkgroup: C1[X(C5F15P5)]
method: RPBEPBE
basis: SDD
operation: Freq
keyword: #pfreq=noraman
keyword: PBEPBE/SDD
title: #p freq=noraman PBEPBE/SDD
converged: YES YES NO NO
title: Mulliken charges:
elementType: P P P P P F F F F F F F F F F F F F F F C C C C C
charge: 0.211992 0.226988 0.193673 0.204809 0.211249 -0.133261 -0.148328 -0.133595 -0.128678 -0.139458 -0.135972 -0.139504 -0.138594 -0.136565 -0.131965 -0.131779 -0.141107 -0.141108 -0.136928 -0.137317 0.199346 0.188561 0.212380 0.198638 0.206521
chargesum: 0.00000
title: Mulliken charges with hydrogens summed into heavy atoms:
polarizability: 2.19413997e+02 4.33432945e-01 2.13051378e+02 5.67553593e+00 -6.25200126e+00 1.52942807e+02
1716.lowfreq: -10.4568 -8.2137 -4.1487 0.0014 0.0024 0.0026 15.6901 28.3196 31.4756
frequency: 15.5072 28.1439 31.3693 34.9191 38.7417 40.2457 52.3630 59.5307 63.8428 70.8065 72.2451 81.2000 92.3648 102.5890 106.2221 130.6029 132.8900 142.6261 162.9590 206.4932 211.1177 213.6046 224.5849 230.2036 265.8266 274.6856 282.1120 284.1820 292.2921 351.3471 367.8035 373.3768 380.3532 387.6318 390.0622 396.9507 399.5815 404.7950 415.7132 455.9010 458.7579 459.2404 461.2390 464.4021 466.4691 471.0128 475.0160 475.7379 482.7948 636.9440 637.3739 638.7307 640.2108 640.7917 967.6327 971.0891 982.2482 988.1395 990.2578 993.3063 997.0308 1004.0161 1005.6393 1011.8854 1013.7986 1020.2549 1023.6073 1025.5042 1035.1862
redmass: 18.3030 18.7607 18.9748 18.7848 18.8471 18.9040 18.9766 18.4366 18.7118 19.6043 20.2243 18.6401 20.2115 21.8013 20.7903 20.6866 19.7007 21.8705 22.4664 19.3304 18.8404 18.8041 18.5513 18.5771 20.6177 20.9802 21.6948 21.4347 22.4929 25.8778 26.9354 26.1226 25.8926 25.6529 25.6718 25.5169 25.7645 26.9092 24.8667 18.1627 18.0968 18.1687 18.1736 18.4657 18.7398 19.0563 19.6005 19.1441 20.3932 17.7821 17.7812 17.7684 17.8832 17.9269 13.2883 13.2683 13.3631 13.3583 13.3675 13.3373 13.3197 13.3100 13.3304 13.2988 13.2923 13.2998 13.3204 13.2899 13.3053
irintensity: 0.0256 0.0982 0.0279 0.0510 0.0336 0.0018 0.4053 0.2746 0.5470 2.0522 3.0723 0.5440 0.3394 0.0671 1.2948 2.5791 1.3665 3.4828 0.5655 0.2193 0.5818 0.8095 0.2653 0.0618 1.1986 1.3753 0.5483 4.2159 2.6193 6.9420 0.7916 6.0156 13.0672 11.9685 6.8677 1.1152 1.8755 0.9024 1.4061 0.7489 0.3032 2.7930 2.3998 0.5032 0.5239 0.2828 0.5929 0.1479 0.0757 15.3916 11.0038 28.4116 15.1488 2.8976 78.2902 68.1120 122.6627 11.9308 530.4623 109.8062 95.8625 183.3510 375.0787 342.3287 549.7034 383.1496 32.3898 121.0512 103.8850
temp: 298.150 k
press: 1.00000 atm
elementType: 15 15 15 15 15 9 9 9 9 9 9 9 9 9 9 9 9 9 9 9 6 6 6 6 6
symmnumber: 1
zpe: 183663.3 jmol-1
zpe.correction: 0.069954 hartree
zpe.thermalcorrener: 0.099544 hartree
zpe.thermalcorrenthalpy: 0.100488 hartree
zpe.thermalcorrgfe: 0.004948 hartree
zpe.sumelectzpe: -3392.374163 hartree
zpe.sumelectthermal: -3392.344573 hartree
zpe.sumelectthermalent: -3392.343628 hartree
zpe.sumelectthermalfe: -3392.439169 hartree
dipole: -0.4147 -0.9829 0.6289
dipole: 1.2384
quadrupole: -186.6825 -184.1240 -187.2606
quadrupole: 0.1866 0.7205 -1.9986
quadrupole: -0.6601 1.8983 -1.2382 0.1866 0.7205 -1.9986
hfenergy: -3392.4441168 hartree
pointgroup: C01 [X(C5F15P5)]
dipole: 0.1755694 0.4022717 0.2114807 debye
dipolederiv: 0.1917085 0.099929 -0.0719104 0.1900967 0.1190206 -0.020108 -0.1301326 -0.0362734 0.1347561 0.0940665 0.0115936 -0.000673 -0.0040682 0.2893776 0.0960617 0.1075805 0.1691678 -0.0025917 0.1352142 -0.1453866 0.0065865 -0.122986 0.0618589 -0.0604992 0.129168 -0.1381093 0.1114983 -0.0097744 0.0019114 0.0132717 -0.0089138 0.0842424 -0.0734126 -0.2285263 -0.1833319 0.2478205 0.0482194 0.0855745 0.0774448 0.0000636 0.0471878 -0.0407434 0.1296679 0.1426433 0.1804891 -0.7794512 0.0440895 -0.219191 0.1277864 -0.2720287 0.0047141 -0.3351853 -0.0515555 -0.3955669 -0.4345286 -0.140458 0.0809815 -0.1395199 -0.3072127 0.0763676 -0.0003105 0.0050584 -0.6930555 -0.2826992 -0.0982562 -0.0878179 -0.1864515 -0.7742795 -0.2299898 -0.1835853 -0.3344803 -0.4226015 -0.7106466 0.2871813 -0.1978953 0.1691355 -0.3062786 0.0932092 -0.2397089 0.1967511 -0.3910432 -0.2402788 0.0882088 -0.0474854 0.0438124 -0.5601635 -0.1250607 -0.0838943 -0.0519141 -0.5681871 -0.349221 -0.1795823 0.0974153 -0.1210378 -0.5563468 0.2546925 0.091748 0.4543931 -0.5606007 -0.2922585 0.0450611 0.0848802 0.1096351 -0.7194859 -0.2242237 0.1735048 -0.3217821 -0.444418 -0.8857352 0.0225011 0.1986043 -0.0695188 -0.2356703 -0.0149868 0.3013554 -0.0591687 -0.3814272 -0.3463475 0.130168 -0.0561469 0.107248 -0.3356443 0.1345112 0.0517014 0.0676898 -0.7301146 -0.8127074 -0.2491422 0.2154 -0.2969085 -0.4075281 0.173937 0.1155609 0.1135299 -0.3123969 -0.5652196 -0.0047795 -0.1005582 -0.0077064 -0.2146783 -0.057262 -0.2253662 -0.0510998 -0.6566085 -0.6775049 0.2447946 0.0951919 0.2893506 -0.5694978 -0.1227694 0.0059751 -0.0537958 -0.2296403 -0.6583208 -0.2976448 0.0750949 -0.2487298 -0.5450435 0.1042964 0.1609281 0.2009636 -0.273287 -0.2753246 -0.0225938 -0.1502806 -0.0542458 -0.4609362 0.0823291 -0.1224608 0.188698 -0.7094911 -0.296387 0.2175667 0.0719287 0.125293 -0.9299855 -0.0673756 0.0540717 0.0106121 -0.2806278 1.3957613 0.2591912 0.2773277 0.2539864 1.2177076 0.1872641 0.574248 0.4284467 1.3700693 1.1724351 -0.2876894 0.1917345 -0.1838012 1.2459041 -0.2260191 0.2765864 -0.6276782 1.4155616 1.4305736 -0.252873 -0.2794164 -0.2017607 1.175724 0.1337586 -0.6146202 0.362055 1.425692 2.0400581 -0.0108995 -0.2673572 0.0105016 1.0561958 0.0160366 0.1028821 -0.0023862 1.0800332 1.1083685 0.1515348 -0.0071297 0.2187389 1.8975608 -0.0947276 -0.1111881 -0.4284334 1.085738 unknown
polarizability: 218.5748751|0.1664702|213.6179746|-9.3769725|2.1684464|153.2153321 unknown
InChI: InChI=1S/5CF3P/c5*2-1(3,4)5
charge 0 multiplicity 1
25 atoms
P  1.769864 1.442415 -0.05085
P  -0.485434 2.161753 0.348651
P  1.771416 -0.973412 0.132374
P  -1.391235 0.118538 1.204759
P  -0.530894 -1.481677 -0.40164
F  3.572698 1.153637 2.033489
F  1.418932 1.07564 2.750093
F  2.338457 3.056249 2.130317
F  -2.268627 2.59498 -1.742164
F  -0.748724 0.982028 -2.245601
F  -0.120902 3.162806 -2.192481
F  2.252772 -2.579349 -2.063183
F  3.755401 -0.892753 -1.791766
F  1.717501 -0.465631 -2.686825
F  -4.007781 -0.737906 1.116847
F  -3.339157 0.026875 -0.902386
F  -3.763735 1.496525 0.780156
F  -1.935416 -3.336751 1.100945
F  -0.044532 -2.68317 2.16803
F  0.09468 -4.068966 0.379331
C  2.293306 1.688759 1.811008
C  -0.936076 2.204426 -1.555674
C  2.38961 -1.223762 -1.704105
C  -3.208955 0.233336 0.48472
C  -0.593469 -2.954489 0.895757
