program: Gaussian 09
title: 000136553
version: EM64L-G09RevD.01
frameworkgroup: C1[X(C12H18O2)]
method: RPBEPBE
basis: SDD
operation: Freq
keyword: #pfreq=noraman
keyword: PBEPBE/SDD
title: #p freq=noraman PBEPBE/SDD
converged: YES YES NO NO
title: Mulliken charges:
elementType: O O C C C C C C C C C C C C H H H H H H H H H H H H H H H H H H
charge: -0.280531 -0.224667 0.295470 -0.097951 -0.098674 -0.098935 -0.534545 -0.524054 -0.523855 -0.448840 -0.448738 -0.449934 0.138925 -0.502759 0.199698 0.200013 0.200083 0.220930 0.220548 0.204444 0.230281 0.229953 0.204640 0.195833 0.196392 0.196396 0.195862 0.196676 0.196840 0.230102 0.240213 0.240185
chargesum: 0.00000
title: Mulliken charges with hydrogens summed into heavy atoms:
elementType: O O C C C C C C C C C C C C
charge: -0.280531 -0.224667 0.295470 0.101748 0.101340 0.101148 -0.093067 -0.089329 -0.089262 -0.056615 -0.056480 -0.056419 0.138925 0.207740
polarizability: 1.41981238e+02 1.39959641e+00 1.18272716e+02 2.32076862e-03 -8.37299151e-04 1.08667619e+02
1716.lowfreq: -46.5983 -0.0006 0.0006 0.0007 6.1476 20.6048 30.8726 96.4344 113.2817
frequency: 26.2172 96.2570 113.2523 125.8411 207.6997 255.3154 295.3610 302.1092 321.9938 323.1372 377.3746 393.6614 422.2273 425.3081 446.9833 469.3288 639.2911 642.6171 661.8829 698.9222 727.5488 764.6456 803.1264 811.9907 848.8219 869.5507 874.4050 877.2017 925.8342 939.8232 948.4302 969.6038 974.8935 980.3964 1040.6889 1041.6772 1050.3715 1052.3016 1102.1270 1102.2472 1104.9725 1109.2571 1111.7228 1114.4902 1145.4526 1176.0641 1180.5518 1196.1825 1251.3490 1262.7509 1284.7581 1289.2947 1289.3333 1306.7754 1311.8895 1313.2835 1325.7361 1341.9416 1342.4205 1351.7458 1357.3249 1358.9022 1420.6488 1451.3475 1452.6021 1453.7947 1462.6286 1465.3136 1466.9637 1467.6524 1486.7090 1622.9806 2964.0533 2965.2890 2965.5884 2976.4974 2978.2466 2986.2945 2995.3864 2998.0094 3002.3352 3009.1186 3021.9238 3022.1982 3030.0883 3044.5327 3051.2421 3052.2449 3102.6439 3146.0864
redmass: 5.7956 2.1707 1.2656 3.4629 3.7056 3.1032 4.3832 1.9745 3.3172 2.3032 3.9709 4.7450 2.0108 1.7345 1.8398 3.2655 3.7778 3.8133 4.2966 7.9402 5.3286 3.9355 2.7823 2.8021 4.2243 1.5782 1.5693 1.5618 3.4266 2.1540 2.5364 2.2674 2.2264 2.4860 1.8957 6.7367 1.7422 1.8605 1.5657 1.3561 1.3428 1.0606 1.2233 1.0163 1.4763 1.9446 1.2190 1.9313 1.4953 1.7458 1.7660 1.8579 1.8358 2.0389 1.5102 1.6320 1.3132 1.4785 1.4523 1.4318 1.5435 1.5712 1.1785 1.0504 1.0816 1.0826 1.0890 1.0543 1.0892 1.0898 1.0900 10.4570 1.0647 1.0611 1.0609 1.0636 1.0640 1.0662 1.0816 1.0793 1.0297 1.0811 1.1029 1.1028 1.1021 1.1012 1.1021 1.1002 1.1043 1.1047
irintensity: 0.9777 1.7019 0.0892 0.9848 6.5856 7.2319 1.2673 0.0186 9.9965 1.6066 0.2246 0.2080 0.4542 0.0300 0.2133 2.4088 0.0132 0.3030 6.6996 3.6639 4.2351 2.5883 4.4515 0.8550 6.2686 0.1241 0.3041 0.0070 1.0810 0.0241 8.8710 5.7013 8.7178 0.9030 0.0790 129.7682 0.0009 5.9276 6.9363 3.6446 7.0686 0.2191 0.0182 0.0019 42.4394 90.9886 0.1116 95.8026 0.0457 1.3098 0.0252 0.1236 0.4982 2.5391 0.5624 0.0457 0.0046 2.5272 3.4972 1.0942 0.3585 0.6446 16.2867 12.8688 0.2840 0.5982 14.5721 12.1312 21.8829 22.1351 1.4629 176.8660 18.9732 26.3326 24.9743 3.8520 27.9631 45.3035 169.8184 132.9329 45.1068 31.0749 14.0056 11.7390 98.0265 2.4754 39.0974 51.0158 27.0204 16.6018
temp: 298.150 k
press: 1.00000 atm
elementType: 8 8 6 6 6 6 6 6 6 6 6 6 6 6 1 1 1 1 1 1 1 1 1 1 1 1 1 1 1 1 1 1
symmnumber: 1
zpe: 732946.5 jmol-1
zpe.correction: 0.279165 hartree
zpe.thermalcorrener: 0.291331 hartree
zpe.thermalcorrenthalpy: 0.292275 hartree
zpe.thermalcorrgfe: 0.240805 hartree
zpe.sumelectzpe: -617.452566 hartree
zpe.sumelectthermal: -617.440399 hartree
zpe.sumelectthermalent: -617.439455 hartree
zpe.sumelectthermalfe: -617.490925 hartree
dipole: 0.4605 -1.8287 0.0022
dipole: 1.8858
quadrupole: -77.8216 -89.1052 -82.7419
quadrupole: 6.6390 -0.0003 -0.0043
quadrupole: 5.4013 -5.8823 0.4810 6.6390 -0.0003 -0.0043
hfenergy: -617.7317304 hartree
pointgroup: C01 [X(C12H18O2)]
dipole: -0.1915237 0.7167643 -0.0007656 debye
polarizability: 141.9359083|1.7402897|118.3178638|-0.0622921|-0.0283004|108.6678011 unknown
InChI: InChI=1S/C12H18O2/c1-14-11(13)12-5-8-2-9(6-12)4-10(3-8)7-12/h8-10H,2-7H2,1H3
charge 0 multiplicity 1
32 atoms
O  2.638504 0.815651 -0.006667
O  2.536555 -1.504678 0.000846
C  0.429653 -0.179821 -0.000776
C  -1.837116 -1.32953 -0.000315
C  -1.532844 0.847684 -1.262604
C  -1.52872 0.840315 1.273626
C  -0.302044 -1.55193 -0.00336
C  0.004322 0.634264 -1.268707
C  0.008493 0.627048 1.273353
C  -2.250799 -0.529662 -1.265239
C  -2.246617 -0.537064 1.270551
C  -1.940776 1.640881 0.008468
C  1.940318 -0.40177 -0.002836
C  4.116209 0.705199 -0.007302
H  -2.343329 -2.314916 -0.002288
H  -1.818339 1.420543 -2.16713
H  -1.811214 1.407939 2.18239
H  0.006017 -2.140294 0.881718
H  0.003122 -2.135407 -0.8927
H  0.306926 0.083794 -2.181875
H  0.531548 1.606109 -1.276075
H  0.535498 1.59904 1.284182
H  0.314234 0.07143 2.182327
H  -1.981014 -1.097705 -2.178226
H  -3.349526 -0.384367 -1.281686
H  -3.345277 -0.391852 1.29151
H  -1.97383 -1.110354 2.17936
H  -1.450526 2.635006 0.010542
H  -3.035413 1.81436 0.010779
H  4.47545 1.743854 -0.010899
H  4.459807 0.160956 -0.903245
H  4.461127 0.166677 0.89158
