program: Gaussian 09
title: 000011770
version: EM64L-G09RevD.01
frameworkgroup: C1[X(C7HF5O2)]
method: RPBEPBE
basis: SDD
operation: Freq
keyword: #pfreq=noraman
keyword: PBEPBE/SDD
title: #p freq=noraman PBEPBE/SDD
converged: NO YES NO NO
title: Mulliken charges:
elementType: F F F F F O O C C C C C C C H
charge: -0.132938 -0.129090 -0.138976 -0.139650 -0.133558 -0.395938 -0.190848 0.101016 0.193273 0.121410 0.082306 0.095997 0.129244 0.140480 0.397272
chargesum: 0.00000
title: Mulliken charges with hydrogens summed into heavy atoms:
elementType: F F F F F O O C C C C C C C
charge: -0.132938 -0.129090 -0.138976 -0.139650 -0.133558 0.001334 -0.190848 0.101016 0.193273 0.121410 0.082306 0.095997 0.129244 0.140480
polarizability: 1.17025621e+02 1.05637455e+00 9.55076744e+01 -1.01108802e+00 -3.60463424e+00 3.91455166e+01
1716.lowfreq: -7.0414 -4.0448 -0.0010 -0.0008 0.0007 3.9420 47.8360 76.0725 119.6950
frequency: 47.8338 76.0716 119.6949 149.3247 158.2434 192.2497 256.6083 262.1706 276.9427 284.7782 300.6237 343.9414 370.6989 419.5312 425.0739 474.0449 544.6312 547.4442 610.1022 631.2619 642.8776 695.7404 756.1023 792.8019 857.5536 930.2171 1018.9763 1077.0661 1087.9850 1222.7062 1307.3787 1363.4816 1380.8168 1448.2967 1469.7249 1598.3976 1621.1198 1655.3993 3518.1505
redmass: 12.0141 12.1745 18.5027 16.2295 9.5260 14.1062 18.6360 18.0268 13.0272 16.2602 13.0384 14.1675 12.6450 10.2206 13.3373 14.2473 11.3899 2.4831 4.7418 2.0320 12.1208 9.2908 12.1378 12.0898 11.5735 13.5074 7.4890 13.5718 3.1642 4.4818 3.4302 11.9641 10.6102 12.1142 12.1164 12.0178 12.0349 10.1788 1.0643
irintensity: 1.6519 0.3929 0.0096 0.2434 0.5026 1.8217 0.1016 0.0816 1.2385 1.1470 2.8055 2.5554 0.5030 2.0609 1.7303 4.9077 7.2241 42.5710 71.2322 105.2334 1.2569 17.9257 4.5248 6.1652 51.4343 179.5876 56.7675 3.9800 250.3373 13.8412 73.8295 4.2143 100.0831 278.0240 71.4744 3.9397 58.4013 292.2038 56.4320
temp: 298.150 k
press: 1.00000 atm
elementType: 9 9 9 9 9 8 8 6 6 6 6 6 6 6 1
symmnumber: 1
zpe: 185038.8 jmol-1
zpe.correction: 0.070478 hartree
zpe.thermalcorrener: 0.082628 hartree
zpe.thermalcorrenthalpy: 0.083572 hartree
zpe.thermalcorrgfe: 0.031529 hartree
zpe.sumelectzpe: -915.954190 hartree
zpe.sumelectthermal: -915.942039 hartree
zpe.sumelectthermalent: -915.941095 hartree
zpe.sumelectthermalfe: -915.993139 hartree
dipole: 1.2826 -1.0577 0.8302
dipole: 1.8582
quadrupole: -74.1187 -86.7854 -74.5152
quadrupole: -5.4925 4.3957 1.6952
quadrupole: 4.3544 -8.3123 3.9579 -5.4925 4.3957 1.6952
hfenergy: -916.0246674 hartree
pointgroup: C01 [X(C7H1F5O2)]
dipole: -0.4980407 0.4291506 0.3197995 debye
dipolederiv: -0.2998764 0.3116864 -0.0379042 0.2466415 -0.7549307 0.0611984 -0.0474281 0.07462 -0.0978364 -0.2812393 -0.2924084 0.0336082 -0.2326071 -0.750209 0.0526003 0.0244588 0.0678001 -0.0912188 -0.3940291 0.3518528 -0.0251619 0.3998262 -0.717243 0.0462978 -0.03134 0.0507892 -0.081111 -0.3877898 -0.3495048 0.0173627 -0.3982427 -0.7404351 0.0375892 0.020314 0.0473185 -0.0814905 -1.0353721 -0.0119885 -0.00959 -0.0092592 -0.1529291 0.0052635 -0.0034707 0.0004383 -0.0776978 -0.6342347 0.3373645 0.297297 0.3653765 -0.68818 -0.2865943 0.3326743 -0.2868048 -0.6513761 -0.8433717 -0.2195295 -0.1746825 -0.1243711 -0.5508679 -0.2709954 -0.008208 -0.2406616 -0.518906 -0.6664198 0.0032802 0.0137262 -0.0190615 -0.1988837 -0.019909 -0.0266599 -0.0284581 -0.0562883 0.4810855 -0.4972173 0.037267 -0.1063306 0.8536995 -0.083292 0.10373 -0.067327 0.1264051 0.4600785 0.4734139 -0.0474232 0.1081956 0.8472978 -0.0723902 -0.0947349 -0.0652769 0.1065549 0.2077969 -0.598977 0.0427943 -0.5610335 0.7041594 -0.046957 0.0580672 -0.051276 0.0697025 0.1861618 0.5950772 -0.03967 0.5512163 0.7313518 -0.0342919 -0.0336106 -0.0450506 0.0650661 1.2012824 0.0126105 0.0120784 0.0055456 0.1970163 -0.0041643 0.000069 0.0017374 0.0976342 1.8098865 -0.0502539 -0.052989 -0.1427801 0.8847318 0.6664603 -0.1668244 0.5786847 0.8248749 0.1960413 -0.065406 -0.0667132 -0.0831159 0.3354219 -0.0508154 -0.1270365 -0.0365331 0.3656872 unknown
polarizability: 117.0541446|0.7519051|95.5859392|0.9918723|2.6345205|39.0387285 unknown
InChI: InChI=1S/C7HF5O2/c8-2-1(7(13)14)3(9)5(11)6(12)4(2)10/h13H
charge 0 multiplicity 1
15 atoms
F  -0.856854 2.423554 -0.191218
F  -0.81012 -2.431625 0.138888
F  1.946468 -2.387758 0.15043
F  1.891263 2.43863 -0.142214
F  3.313026 0.042859 0.016475
O  -2.979704 0.921131 0.741332
O  -3.087279 -0.888642 -0.718709
C  -0.918859 -0.007418 -0.018137
C  -0.197363 1.208451 -0.076589
C  -0.168024 -1.206459 0.046953
C  1.239635 -1.199543 0.064607
C  1.210882 1.233705 -0.067973
C  1.930572 0.02602 0.005046
C  -2.417557 -0.064773 -0.065909
H  -3.972686 0.884366 0.672618
