program: Gaussian 09
title: 000136510
version: EM64L-G09RevD.01
frameworkgroup: C1[X(C8H12)]
method: RPBEPBE
basis: SDD
operation: Freq
keyword: #p
keyword: freq=noraman
keyword: PBEPBE/SDD
title: #p freq=noraman PBEPBE/SDD
converged: NO YES NO NO
title: Mulliken charges:
elementType: C C C C C C C C H H H H H H H H H H H H
charge: -0.309759 -0.204704 -0.505240 -0.464322 -0.446418 0.471869 -0.415228 -0.843873 0.237358 0.231105 0.207292 0.243514 0.217584 0.224106 0.219113 0.219636 0.242297 0.227984 0.224372 0.223314
chargesum: 0.00000
title: Mulliken charges with hydrogens summed into heavy atoms:
elementType: C C C C C C C C
charge: -0.072402 0.026402 -0.054434 -0.022632 -0.007669 0.471869 -0.172931 -0.168203
polarizability: 8.74979757e+01 3.62078638e+00 7.83734427e+01 1.03433999e+00 3.19996211e+00 6.89884490e+01
1716.lowfreq: -0.0003 -0.0002 0.0003 8.6475 20.3924 31.2374 158.2248 177.3409 236.1251
frequency: 158.2093 177.3394 236.1153 312.8330 405.1882 462.7202 524.1862 577.8309 700.6414 773.0551 803.4254 807.0929 831.9689 861.3791 875.7034 923.1658 937.1735 951.5646 961.6668 989.9046 1022.7615 1033.9168 1046.1175 1101.8049 1111.9669 1137.0559 1156.8934 1199.9814 1207.1675 1235.1093 1258.5047 1267.5588 1271.1977 1294.4343 1323.3153 1393.7699 1459.5419 1461.8905 1465.4469 1467.6705 1483.8505 1644.9675 2953.6723 2994.1221 2999.8536 3010.1575 3022.2940 3056.1643 3063.5905 3071.6743 3075.1594 3079.5364 3085.2386 3155.7815
redmass: 2.3571 1.0891 1.8380 2.2472 2.4003 2.0830 3.0720 3.3765 3.6601 2.9903 1.5718 1.5350 2.3711 2.6157 2.3797 2.7796 1.9210 2.2404 1.8305 1.3878 1.5880 1.5867 1.5314 1.1204 1.1492 1.9152 1.3426 1.5944 1.4696 1.4014 1.3620 1.5992 1.7633 1.5239 2.1305 1.2641 1.0494 1.0981 1.0799 1.0709 1.0977 6.4209 1.0376 1.0596 1.0606 1.0626 1.0962 1.1029 1.0900 1.0974 1.0990 1.0977 1.1041 1.0980
irintensity: 2.7508 0.1205 0.3445 1.1001 0.1438 1.1730 3.2723 2.7926 2.4017 3.3347 18.0304 9.8993 2.1249 2.2044 12.8576 3.0533 0.0593 2.2779 2.0911 7.9596 5.0883 0.2324 2.1501 2.4599 7.5259 0.9891 0.8058 0.3489 0.9012 0.7290 1.4652 4.5554 5.2896 2.2945 7.7277 10.2170 13.7910 9.6955 2.8549 13.0584 4.8479 6.0440 43.4304 32.6560 50.1893 67.3330 26.1735 6.3443 54.5114 37.0182 23.5634 72.9007 41.3546 16.3307
temp: 298.150 k
press: 1.00000 atm
elementType: 6 6 6 6 6 6 6 6 1 1 1 1 1 1 1 1 1 1 1 1
symmnumber: 1
zpe: 465845.8 jmol-1
zpe.correction: 0.177431 hartree
zpe.thermalcorrener: 0.184437 hartree
zpe.thermalcorrenthalpy: 0.185381 hartree
zpe.thermalcorrgfe: 0.146710 hartree
zpe.sumelectzpe: -311.400294 hartree
zpe.sumelectthermal: -311.393288 hartree
zpe.sumelectthermalent: -311.392344 hartree
zpe.sumelectthermalfe: -311.431015 hartree
dipole: 0.0117 0.4532 -0.1083
dipole: 0.4661
quadrupole: -47.8145 -49.2976 -49.8694
quadrupole: 0.6027 -0.7014 1.2611
quadrupole: 1.1793 -0.3038 -0.8756 0.6027 -0.7014 1.2611
hfenergy: -311.5777249 hartree
pointgroup: C01 [X(C8H12)]
dipole: 0.0022301 -0.1782222 -0.0431412 debye
dipolederiv: -0.0654993 0.0414343 -0.0953958 0.0326778 0.0951006 -0.0227257 -0.0726806 -0.0918612 0.106687 0.0816356 0.0669285 -0.0598812 0.1248067 0.1572815 0.0457409 0.0308415 0.0760959 0.043359 0.0849556 -0.1175342 0.0494393 -0.1049307 -0.0271497 0.0300225 0.0372383 0.0308176 0.0326439 0.0704482 -0.0260175 0.0698476 -0.0135926 0.0021403 0.0037555 0.0508189 0.0484888 0.0405603 0.0269882 -0.0351149 0.0574514 -0.0625785 -0.0201556 -0.0161915 0.0052536 -0.0409418 0.0879313 0.2169827 0.0847955 0.0855182 0.0068785 0.1412223 -0.1108703 0.1551176 -0.0509803 -0.1185717 -0.0151966 -0.0499401 0.0781326 -0.060111 -0.2220033 -0.1379688 0.0339757 -0.1831266 -0.1810862 -0.0691655 -0.0310205 -0.0497058 -0.0664547 0.0390901 0.0142218 -0.0508024 0.0206817 0.0904975 0.0052585 -0.0773492 0.0758441 -0.0687976 -0.0662849 0.0992551 0.0682253 0.1011504 -0.0280786 -0.0342978 -0.1186218 0.0051607 -0.120925 -0.1306521 -0.0039874 -0.0029225 -0.0091616 0.0645411 -0.1424073 0.0810232 -0.1341959 0.1061053 0.0437663 0.0603211 -0.0870465 0.0262583 0.0259349 0.0336017 0.0596641 0.1035751 0.036567 -0.0066213 -0.1182631 0.0565954 -0.0866928 -0.08315 0.0094997 -0.0936882 -0.0829848 -0.0466457 -0.0052113 -0.0712444 -0.0736856 -0.1010603 -0.0734164 -0.048693 0.1569498 -0.0469007 0.0982447 -0.0950997 0.0461097 -0.0412846 0.0618349 0.0438566 -0.2301761 0.0093722 0.0148835 0.0783516 0.0597834 -0.0043348 -0.0299784 0.0070988 0.0593604 0.0711736 0.0085759 -0.0314872 -0.0206789 0.0398197 0.0404293 0.0197119 0.036157 -0.1772072 0.02365 0.0553524 -0.0687063 0.0504917 0.0215382 0.1193076 -0.0856714 0.1515913 0.075363 -0.0191694 0.0393235 -0.0566268 0.1174576 -0.0244742 0.1039394 -0.0994404 0.0864521 0.0316628 -0.0400804 -0.0526557 0.0676365 -0.0301379 0.0946154 0.0337401 0.1392931 0.038471 -0.0833019 0.0404916 -0.0014771 0.0183954 -0.0567285 -0.0967058 -0.1112569 -0.0535591 -0.1212733 0.042414 unknown
polarizability: 87.3099142|3.9968112|78.6232245|-0.326178|-3.0699779|68.9267287 unknown
InChI: InChI=1S/C8H12/c1-6-4-7-2-3-8(6)5-7/h4,7-8H,2-3,5H2,1H3
charge 0 multiplicity 1
20 atoms
C  -0.124265 -0.795683 0.724252
C  1.015862 1.043857 0.022934
C  0.822536 0.266741 1.363664
C  0.818119 -1.373732 -0.403778
C  1.613535 -0.103847 -0.883374
C  -1.139714 0.114723 0.006407
C  -0.446871 1.218152 -0.406739
C  -2.563709 -0.279338 -0.272095
H  -0.55342 -1.56175 1.390415
H  1.625332 1.960254 0.054283
H  1.761178 -0.165043 1.760025
H  0.325807 0.872986 2.140306
H  0.239131 -1.844449 -1.217619
H  1.497761 -2.137838 0.016814
H  2.698647 -0.217981 -0.701412
H  1.467601 0.108729 -1.956327
H  -0.820513 2.030334 -1.038013
H  -3.095681 0.493182 -0.855413
H  -3.126159 -0.447145 0.668069
H  -2.613875 -1.230251 -0.8408
