program: Gaussian 09
title: 000136500
version: EM64L-G09RevD.01
frameworkgroup: C1[X(C4H5NS)]
method: RPBEPBE
basis: SDD
operation: Freq
keyword: #pfreq=noraman
keyword: PBEPBE/SDD
title: #p freq=noraman PBEPBE/SDD
converged: NO YES NO YES
title: Mulliken charges:
elementType: S N C C C C H H H H H
charge: 0.326264 -0.321558 -0.044313 -0.731183 -0.284467 -0.197138 0.246160 0.239642 0.246189 0.260300 0.260105
chargesum: 0.00000
title: Mulliken charges with hydrogens summed into heavy atoms:
elementType: S N C C C C
charge: 0.326264 -0.321558 -0.044313 0.000808 -0.024167 0.062967
polarizability: 7.89971991e+01 -3.76241627e+00 7.16181023e+01 4.58111354e-03 -4.81651882e-04 3.09575686e+01
1716.lowfreq: -13.7367 -8.2389 -0.0029 -0.0028 -0.0023 10.7092 80.3029 223.0200 290.6321
frequency: 80.0562 223.0176 290.6306 467.9023 510.8292 580.0982 594.4849 622.7275 810.0917 822.2119 895.4185 968.5403 1039.2657 1045.5382 1155.6391 1218.1717 1287.1818 1399.6008 1419.8334 1458.5084 1465.6646 1552.4415 2984.8884 3065.5020 3092.9457 3160.3071 3194.5442
redmass: 1.0547 3.6362 3.1076 5.3234 7.1164 2.8874 8.7343 6.4923 6.5113 1.1838 1.4416 1.8097 1.4347 1.4382 3.9223 1.3938 2.2497 1.2149 5.1964 1.0429 1.0949 5.1400 1.0364 1.0979 1.0993 1.0913 1.0990
irintensity: 0.5554 0.3265 0.3668 23.4370 1.1146 0.4733 7.7894 1.0748 8.0560 63.6874 0.1040 0.8967 6.5842 3.4471 14.5511 22.0732 5.6947 10.3602 14.5329 17.5535 17.0348 18.3943 19.0643 13.7648 13.5191 4.6576 3.2165
temp: 298.150 k
press: 1.00000 atm
elementType: 16 7 6 6 6 6 1 1 1 1 1
symmnumber: 1
zpe: 211775.2 jmol-1
zpe.correction: 0.080661 hartree
zpe.thermalcorrener: 0.086556 hartree
zpe.thermalcorrenthalpy: 0.087500 hartree
zpe.thermalcorrgfe: 0.050680 hartree
zpe.sumelectzpe: -607.763769 hartree
zpe.sumelectthermal: -607.757874 hartree
zpe.sumelectthermalent: -607.756930 hartree
zpe.sumelectthermalfe: -607.793750 hartree
dipole: 3.1198 1.8827 0.0003
dipole: 3.6438
quadrupole: -42.4599 -39.4655 -44.9465
quadrupole: -3.1998 0.0008 -0.0002
quadrupole: -0.1693 2.8251 -2.6558 -3.1998 0.0008 -0.0002
hfenergy: -607.84443 hartree
pointgroup: C01 [X(C4H5N1S1)]
dipole: 1.2052251 -0.7762915 -0.0001058 debye
dipolederiv: -0.204877 -0.1503101 -0.0000097 -0.0649612 -0.1985879 0.0000004 0.000019 -0.0000163 0.154905 -0.1286249 0.3511684 0.0000493 0.2768079 -0.0335111 -0.0000012 -0.0000016 0.0000023 -0.3254949 0.3517672 -0.0997011 -0.0001324 -0.0378845 0.4294796 -0.0000122 -0.0002332 -0.0000571 -0.1913697 -0.1262865 -0.0019226 0.0000453 0.0180543 0.0321112 -0.0000109 0.0002831 0.0000176 0.1006429 -0.4059056 -0.1753514 0.0000309 -0.1151498 -0.1787166 0.0000236 0.0000577 0.000021 -0.1779772 0.3298913 0.0715533 -0.0000359 -0.0774805 -0.0546684 -0.0000259 -0.000017 -0.0000104 -0.0439611 0.0267725 -0.0159652 -0.0369846 -0.0374181 0.0589637 -0.0994046 -0.0860128 -0.0832969 -0.0214293 0.0014916 0.0393316 -0.0000207 0.1106887 -0.0847654 0.0002188 -0.0001169 0.0001768 0.1272448 0.0266489 -0.0159253 0.0370572 -0.0372215 0.0593234 0.0992029 0.0860175 0.0831415 -0.0218092 0.093206 0.0601189 -0.0000053 0.0674927 -0.0396612 -0.0000024 -0.0000044 0.0000052 0.2132606 0.0359166 -0.0629966 0.000006 -0.1029279 0.0100328 0.0000116 0.0000087 0.0000162 0.1859882 unknown
polarizability: 79.2109397|3.5401806|71.4043618|-0.0045932|-0.0003474|30.9575686 unknown
InChI: InChI=1S/C4H5NS/c1-4-2-3-5-6-4/h2-3H,1H3
charge 0 multiplicity 1
11 atoms
S  -0.180181 1.473131 -0.000083
N  -1.736099 0.53066 -0.000112
C  0.836276 -0.022618 -0.0002
C  2.337699 0.040514 -0.000432
C  0.000226 -1.131695 -0.000102
C  -1.39689 -0.773851 -0.000066
H  2.722701 0.571014 0.889696
H  2.762976 -0.977399 0.000549
H  2.722463 0.56919 -0.891757
H  0.363799 -2.160955 -0.000096
H  -2.22297 -1.491792 0.000003
