program: Gaussian 09
title: 000136479
version: EM64L-G09RevD.01
frameworkgroup: C1[X(C6H8F6O)]
method: RPBEPBE
basis: SDD
operation: Freq
keyword: #pfreq=noraman
keyword: PBEPBE/SDD
title: #p freq=noraman PBEPBE/SDD
converged: YES YES NO NO
title: Mulliken charges:
elementType: F F F F F F O C C C C C C H H H H H H H H
charge: -0.161961 -0.170076 -0.169975 -0.161962 -0.170073 -0.169977 -0.271918 -0.247595 -0.247595 -0.491656 -0.491656 0.407478 0.407478 0.220409 0.220309 0.220410 0.220308 0.264511 0.264515 0.264511 0.264514
chargesum: 0.00000
title: Mulliken charges with hydrogens summed into heavy atoms:
elementType: F F F F F F O C C C C C C
charge: -0.161961 -0.170076 -0.169975 -0.161962 -0.170073 -0.169977 -0.271918 0.193123 0.193123 0.037370 0.037370 0.407478 0.407478
polarizability: 8.91704122e+01 9.71315300e-07 6.44644042e+01 2.95897578e-02 9.50448230e-06 6.17157739e+01
1716.lowfreq: 0.0008 0.0011 0.0011 3.6282 4.0640 5.8495 20.9567 27.1978 55.0342
frequency: 20.8506 27.1344 55.0342 72.3830 85.7463 128.6245 128.6992 136.0455 160.7831 255.5919 326.8086 327.9774 350.9070 372.4699 420.6710 471.1051 471.1384 489.0790 532.2646 572.5477 597.6427 768.0928 778.9311 801.2292 807.4235 918.1982 923.8987 931.6524 1006.9652 1040.1082 1069.8810 1085.3891 1108.2316 1115.0865 1138.2158 1206.9677 1216.0346 1218.3551 1219.5407 1283.7887 1287.4352 1316.8450 1338.7614 1381.5895 1424.9560 1452.0925 1454.2492 1487.0132 1501.7897 2953.1419 2959.2045 3010.2925 3013.0570 3043.4139 3043.4932 3109.3588 3109.3802
redmass: 11.1197 7.7316 9.4125 5.5365 2.3098 6.1205 2.0640 8.0678 11.1052 11.1736 4.1247 4.0488 7.0389 8.8145 7.8156 6.7877 6.8506 9.3973 5.0065 10.1687 9.5231 7.0795 5.7233 1.3135 1.3647 6.4769 2.3099 2.2524 10.6913 8.0001 3.7545 8.9969 3.6916 1.8209 2.0445 1.2932 1.2931 4.0750 3.9121 1.1432 1.1403 1.3948 1.6777 1.4846 1.4581 1.0855 1.0892 1.0839 1.0764 1.0555 1.0551 1.1071 1.1085 1.0599 1.0600 1.1034 1.1032
irintensity: 0.0000 2.6951 2.5565 0.0002 3.5148 12.1724 0.0016 5.1135 0.1244 0.7489 0.0000 2.6427 7.5965 5.0030 8.2356 0.8243 0.0001 10.8170 0.2007 14.7872 24.7323 24.2133 24.1443 0.0033 12.5981 22.6832 0.0001 257.2459 268.8739 245.6193 23.0700 59.0044 50.4250 0.0080 156.9364 0.0080 45.7062 184.5598 105.3239 0.0021 25.8304 82.1895 1.5280 132.7118 2.2315 10.1645 21.8493 2.0929 6.6860 15.2604 65.1052 67.1436 0.0018 4.1825 5.4411 0.0000 11.3917
temp: 298.150 k
press: 1.00000 atm
elementType: 9 9 9 9 9 9 8 6 6 6 6 6 6 1 1 1 1 1 1 1 1
symmnumber: 1
zpe: 373997.9 jmol-1
zpe.correction: 0.142448 hartree
zpe.thermalcorrener: 0.156405 hartree
zpe.thermalcorrenthalpy: 0.157349 hartree
zpe.thermalcorrgfe: 0.098397 hartree
zpe.sumelectzpe: -906.677586 hartree
zpe.sumelectthermal: -906.663629 hartree
zpe.sumelectthermalent: -906.662685 hartree
zpe.sumelectthermalfe: -906.721638 hartree
dipole: 0.0000 0.8444 0.0000
dipole: 0.8444
quadrupole: -105.2345 -73.6013 -74.1908
quadrupole: 0.0000 0.0495 0.0000
quadrupole: -20.8923 10.7409 10.1514 0.0000 0.0495 0.0000
hfenergy: -906.8200347 hartree
pointgroup: C01 [X(C6H8F6O1)]
dipole: -0.0000017 0.3322198 0.0000108 debye
dipolederiv: -0.7955492 0.3125417 -0.0024735 0.2326281 -0.5459509 0.001877 -0.0020634 0.0019987 -0.2925566 -0.4355258 -0.0847614 -0.0948036 -0.071033 -0.4913543 -0.2699013 -0.0340228 -0.2327682 -0.6385435 -0.4356039 -0.0841125 0.0963147 -0.0712337 -0.4848326 0.267654 0.0356041 0.2306301 -0.6447302 -0.7955482 -0.3125412 -0.0024846 -0.2326281 -0.5459513 -0.0018859 -0.0020726 -0.0020074 -0.2925568 -0.4355239 0.0847637 -0.0948011 0.0710331 -0.4913692 0.2699076 -0.0340203 0.2327735 -0.6385284 -0.4356055 0.0841103 0.0963173 0.0712339 -0.4848178 -0.2676475 0.0356071 -0.2306243 -0.6447445 -1.2293304 -0.0000004 -0.0014719 -0.0000008 -0.378283 0.000001 -0.0020694 0. -0.4070648 0.7660153 0.0982388 0.0004802 0.2044248 0.2872465 0.0009591 0.0010031 0.0003013 0.4132399 0.7660152 -0.0982387 0.0004779 -0.2044234 0.2872467 -0.0009634 0.0009948 -0.0003057 0.4132402 -0.363838 -0.0469409 -0.0000849 -0.0833626 -0.0867014 -0.0000595 0.0002336 0.0000143 -0.0132837 -0.3638383 0.0469414 -0.0000852 0.0833627 -0.086702 0.0000574 0.0002336 -0.0000149 -0.0132841 1.7109626 -0.0714277 0.0005918 0.0225076 1.4600293 0.0005015 -0.0002744 0.0004039 1.5163662 1.7109617 0.071427 0.0005965 -0.0225081 1.4600297 -0.0005048 -0.0002716 -0.0004068 1.5163658 -0.0121203 0.0058694 -0.0196272 -0.0628665 -0.0332486 0.0891235 0.0255043 0.1216522 -0.0783197 -0.0123502 0.0068537 0.0201312 -0.0621371 -0.0337431 -0.0896119 -0.0248657 -0.1217375 -0.0778831 -0.0121201 -0.0058694 -0.0196279 0.0628649 -0.0332415 -0.0891218 0.0255052 -0.1216506 -0.0783261 -0.0123505 -0.0068532 0.0201301 0.0621386 -0.0337499 0.0896133 -0.0248645 0.121739 -0.0778767 0.0966043 -0.0104556 -0.0038836 0.0196923 0.0582857 -0.0736093 0.0129495 -0.0847619 0.0103687 0.0960706 -0.0101322 0.004093 0.0197366 0.059411 0.0733534 -0.01303 0.0844933 0.0088741 0.0966038 0.0104547 -0.0038828 -0.0196935 0.0582818 0.0736103 0.0129494 0.084763 0.0103731 0.0960708 0.0101326 0.0040936 -0.0197358 0.0594149 -0.0733525 -0.0130301 -0.0844922 0.00887 unknown
polarizability: 89.1702856|0.0000047|64.4644042|0.0659774|0.0000627|61.7159005 unknown
InChI: InChI=1S/C6H8F6O/c7-5(8,9)1-3-13-4-2-6(10,11)12/h1-4H2
charge 0 multiplicity 1
21 atoms
F  -4.793514 0.992228 -0.012196
F  -3.925386 -0.780608 -1.134279
F  -3.92776 -0.765838 1.13456
F  4.793485 0.992231 0.012259
F  3.925355 -0.780641 1.134282
F  3.927735 -0.765803 -1.134556
O  -0.000015 0.54763 0.000024
C  -1.21702 -0.269802 -0.002938
C  1.216991 -0.269802 0.002955
C  -2.378825 0.734782 -0.008014
C  2.378796 0.734782 0.008057
C  -3.732644 0.058833 -0.005029
C  3.732615 0.058834 0.005062
H  -1.25359 -0.915114 0.899592
H  -1.247635 -0.917501 -0.903927
H  1.253558 -0.915086 -0.899595
H  1.247611 -0.917529 0.903925
H  -2.312258 1.384219 0.881279
H  -2.312267 1.376433 -0.902904
H  2.312233 1.38424 -0.881221
H  2.312235 1.376413 0.902961
