program: Gaussian 09
title: 000136478
version: EM64L-G09RevD.01
frameworkgroup: C1[X(C3ClF3)]
method: RPBEPBE
basis: SDD
operation: Freq
keyword: #pfreq=noraman
keyword: PBEPBE/SDD
title: #p freq=noraman PBEPBE/SDD
converged: NO YES YES YES
title: Mulliken charges:
elementType: Cl F F F C C C
charge: 0.162061 -0.150319 -0.150340 -0.150441 0.307025 0.293981 -0.311968
chargesum: 0.00000
title: Mulliken charges with hydrogens summed into heavy atoms:
polarizability: 7.52695581e+01 -2.45053939e-03 2.35711847e+01 7.47476772e-04 1.01265115e-05 2.35691976e+01
1716.lowfreq: -0.0043 -0.0025 -0.0020 4.3875 5.5942 9.7836 94.8465 95.4826 297.6313
frequency: 94.8461 95.4813 297.6311 297.7053 346.5699 402.5380 402.7102 555.9867 556.0751 621.1876 841.9797 987.5041 987.9075 1234.6005 2288.9025
redmass: 16.8069 16.8024 13.8690 13.8699 23.5232 15.5365 15.5330 14.8997 14.9060 17.9158 15.0203 13.0753 13.0753 12.3352 12.0203
irintensity: 0.0534 0.0527 0.5762 0.5770 1.5397 0.8921 0.8899 1.2791 1.2792 29.7859 142.0533 281.3902 281.4551 376.7877 321.2395
temp: 298.150 k
press: 1.00000 atm
elementType: 17 9 9 9 6 6 6
symmnumber: 1
zpe: 59882.8 jmol-1
zpe.correction: 0.022808 hartree
zpe.thermalcorrener: 0.029633 hartree
zpe.thermalcorrenthalpy: 0.030577 hartree
zpe.thermalcorrgfe: -0.009478 hartree
zpe.sumelectzpe: -873.293687 hartree
zpe.sumelectthermal: -873.286862 hartree
zpe.sumelectthermalent: -873.285918 hartree
zpe.sumelectthermalfe: -873.325972 hartree
dipole: 3.3643 -0.0007 0.0000
dipole: 3.3643
quadrupole: -42.2921 -45.5799 -45.5789
quadrupole: 0.0010 -0.0004 0.0000
quadrupole: 2.1915 -1.0963 -1.0952 0.0010 -0.0004 0.0000
hfenergy: -873.3164949 hartree
pointgroup: C01 [X(C3Cl1F3)]
dipole: 1.323603 0.0002447 -0.0001883 debye
dipolederiv: -0.5759139 -0.0000489 0.0000608 -0.0000957 0.1541148 -0.0000021 0.0000187 -0.0000017 0.1541117 -0.6198442 0.0443921 -0.2102967 0.0582434 -0.3135646 0.0948592 -0.2757609 0.0947969 -0.7429329 -0.6197609 0.1599498 0.1436108 0.2097803 -0.5534809 -0.2333636 0.1882687 -0.2332951 -0.5030252 -0.620059 -0.2043788 0.0667861 -0.2679986 -0.7175312 0.1385441 0.0875255 0.1384469 -0.3388499 2.5894136 -0.0000152 -0.0001685 -0.0001851 1.6687397 -0.0000439 -0.0001134 0.0000516 1.6689278 -1.3051071 -0.0000342 0.000124 0.0000711 -0.1889209 -0.0000023 0.0001282 -0.0000064 -0.1888949 1.1512716 0.0001351 -0.0001166 0.0001847 -0.0493569 0.0000087 -0.0000667 0.0000077 -0.0493366 unknown
polarizability: 75.2695575|0.0017982|23.571038|-0.0060522|-0.0005197|23.5693449 unknown
InChI: InChI=1S/C3ClF3/c4-2-1-3(5,6)7
charge 0 multiplicity 1
7 atoms
Cl 3.386835 0.000025 -0.000273
F  -1.521943 0.270875 -1.283231
F  -1.521928 0.976153 0.876233
F  -1.522202 -1.246802 0.407331
C  -0.982056 0.000063 0.000086
C  0.466996 -0.000223 0.000021
C  1.694397 -0.000191 -0.000166
