program: Gaussian 09
title: 000136466
version: EM64L-G09RevD.01
frameworkgroup: C1[X(C8F10)]
method: RPBEPBE
basis: SDD
operation: Freq
keyword: #p
keyword: freq=noraman
keyword: PBEPBE/SDD
title: #p freq=noraman PBEPBE/SDD
converged: NO NO NO NO
title: Mulliken charges:
elementType: F F F F F F F F F F C C C C C C C C
charge: -0.120226 -0.120229 -0.124320 -0.124309 -0.141287 -0.129518 -0.141135 -0.129527 -0.141144 -0.141268 0.033043 0.033035 0.080577 0.080577 0.217634 0.217645 0.325226 0.325227
chargesum: 0.00000
title: Mulliken charges with hydrogens summed into heavy atoms:
polarizability: 1.17746728e+02 1.09434921e-04 1.04545769e+02 3.46362280e-03 1.49669848e-04 5.01531661e+01
1716.lowfreq: -0.0012 -0.0009 -0.0006 2.8344 6.3721 8.6469 30.3440 32.6454 49.6292
frequency: 30.3071 32.5802 49.6281 101.5061 116.6652 131.9947 171.9179 177.4183 219.6805 222.2570 267.1413 281.5514 288.1167 289.1997 310.9074 324.8988 383.0403 404.9238 412.3460 421.0400 464.1731 468.1457 476.2443 480.8721 536.7600 627.6354 629.6016 661.1212 682.8931 734.8431 774.8905 788.3151 881.3474 924.9023 1005.6592 1010.5711 1035.3719 1044.3467 1070.6071 1101.0690 1201.6161 1278.9544 1338.8476 1378.2517 1448.6209 1448.9807 1587.0291 1634.5402
redmass: 18.9853 18.5768 17.3917 17.7572 18.4479 17.4151 16.5152 18.1539 17.3548 17.4654 18.5078 18.6816 18.7492 18.4625 15.2799 18.2489 12.6297 15.6922 16.1497 16.0014 16.8978 17.6700 16.6930 17.8754 15.0353 17.0134 17.0003 12.1809 12.8250 13.0569 15.2303 12.1953 13.8403 14.2793 13.0229 13.0027 12.9897 13.0588 13.1863 13.1894 12.4973 12.4394 12.2437 12.3270 12.2645 12.0739 12.0244 12.0151
irintensity: 0.0000 0.1527 1.0399 0.0000 0.0000 1.7173 3.6284 0.1305 0.0000 0.0398 0.5698 0.3340 0.1030 0.5082 0.5257 0.5765 0.0031 0.0000 14.3491 0.4031 2.2708 0.0007 0.0009 2.7009 0.0000 62.5263 0.0004 0.0000 0.0380 0.9955 65.4182 0.0000 0.4806 227.0012 0.0073 512.5101 59.9447 129.1593 197.2163 49.4892 0.7857 449.8445 32.5468 22.9362 421.8903 65.2285 0.7924 3.1132
temp: 298.150 k
press: 1.00000 atm
elementType: 9 9 9 9 9 9 9 9 9 9 6 6 6 6 6 6 6 6
symmnumber: 1
zpe: 187534.6 jmol-1
zpe.correction: 0.071428 hartree
zpe.thermalcorrener: 0.087351 hartree
zpe.thermalcorrenthalpy: 0.088295 hartree
zpe.thermalcorrgfe: 0.026609 hartree
zpe.sumelectzpe: -1301.917099 hartree
zpe.sumelectthermal: -1301.901177 hartree
zpe.sumelectthermalent: -1301.900233 hartree
zpe.sumelectthermalfe: -1301.961918 hartree
dipole: 0.0001 0.4548 -0.0004
dipole: 0.4548
quadrupole: -113.2921 -105.4883 -95.5960
quadrupole: -0.0006 0.0082 0.0002
quadrupole: -8.4999 -0.6962 9.1961 -0.0006 0.0082 0.0002
hfenergy: -1301.9885276 hartree
pointgroup: C01 [X(C8F10)]
dipole: 0.0000266 -0.1789363 0.0001508 debye
dipolederiv: -0.3197273 -0.3151451 -0.000128 -0.3070945 -0.7503167 -0.0001293 -0.000053 -0.0000783 -0.0881353 -0.3197361 0.3151464 -0.000168 0.3070989 -0.7503021 0.0001946 -0.0000798 0.0002015 -0.0881383 -0.3476634 0.322385 -0.0001833 0.3245063 -0.7199924 0.0001756 -0.0002084 0.0002447 -0.0810277 -0.3476614 -0.322396 -0.0002297 -0.3245207 -0.7200166 -0.0002564 -0.0002289 -0.0003557 -0.0810194 -0.584816 0.1006506 -0.1581211 0.1371198 -0.3538069 0.2025117 -0.1592519 0.1822448 -0.6152246 -0.527546 -0.2312599 -0.0000999 -0.1913916 -0.5996153 0.0000915 -0.0002188 -0.0000416 -0.2682351 -0.5853094 0.1013346 0.1582176 0.1378472 -0.3542727 -0.2026345 0.1590102 -0.1823344 -0.6139805 -0.527554 0.2312583 0.0000334 0.1913867 -0.5996064 -0.0003044 -0.000108 -0.0001992 -0.2682389 -0.5852012 -0.1013528 0.1581213 -0.1378523 -0.3544213 0.2027364 0.1588872 0.1824409 -0.6138731 -0.5849152 -0.1006374 -0.1582158 -0.1371209 -0.3536647 -0.2024174 -0.1593699 -0.1821468 -0.6153369 -0.4701332 0.0062924 -0.0002059 -0.0236923 -0.1034801 0.0000402 0.0001435 0.000044 -0.1641619 -0.4701283 -0.0062875 -0.0002089 0.0236746 -0.103485 -0.0000327 0.0001049 -0.000034 -0.1641643 0.3666495 0.6849615 0.0000915 0.2218236 0.7993333 -0.0000378 -0.0001256 0.0002071 0.1241913 0.3666671 -0.6849673 0.0001736 -0.2218266 0.7993132 -0.0000769 -0.0000332 -0.0003479 0.1241957 0.3757496 -0.6790262 0.0001139 -0.2693345 0.7604609 -0.0001256 0.0001464 -0.0004371 0.1156959 0.3757536 0.6790288 0.0002097 0.269357 0.7604976 0.0002381 0.0002077 0.0005595 0.1157007 2.0927888 0.0107437 0.0002945 -0.0306215 1.3216885 0.0000755 0.0005478 0.0001024 1.5908715 2.0927827 -0.010729 0.0003052 0.0306405 1.3216866 -0.0000486 0.0006299 -0.0000698 1.5908809 unknown
polarizability: 117.7466786|-0.0000482|104.5457688|0.0577983|0.0001858|50.1532153 unknown
InChI: InChI=1S/C8F10/c9-3-1(7(13,14)15)4(10)6(12)2(5(3)11)8(16,17)18
charge 0 multiplicity 1
18 atoms
F  -1.33163 -2.491409 -0.000568
F  1.331658 -2.491387 0.000888
F  -1.362202 2.372177 -0.00076
F  1.362174 2.372182 0.001119
F  -3.425875 0.728959 -1.140392
F  -3.590939 -1.21858 -0.00276
F  -3.42844 0.730613 1.132564
F  3.590956 -1.218547 0.001839
F  3.428124 0.731127 -1.132614
F  3.426168 0.728509 1.140333
C  -1.440978 -0.051422 -0.00091
C  1.440975 -0.051406 0.000982
C  -0.70803 -1.256785 -0.000388
C  0.708044 -1.256768 0.000553
C  -0.702624 1.155708 -0.000329
C  0.702619 1.155725 0.000537
C  -2.95875 0.030632 -0.002712
C  2.958749 0.030671 0.002518
