program: Gaussian 09
title: 000136465
version: EM64L-G09RevD.01
frameworkgroup: C1[X(C7HF7)]
method: RPBEPBE
basis: SDD
operation: Freq
keyword: #p
keyword: freq=noraman
keyword: PBEPBE/SDD
title: #p freq=noraman PBEPBE/SDD
converged: NO NO NO NO
title: Mulliken charges:
elementType: F F F F F F F C C C C C C C H
charge: -0.133120 -0.128991 -0.135860 -0.147744 -0.147850 -0.157595 -0.156671 0.034530 0.166734 0.058789 0.336500 0.278661 0.273567 -0.445401 0.304451
chargesum: 0.00000
title: Mulliken charges with hydrogens summed into heavy atoms:
elementType: F F F F F F F C C C C C C C
charge: -0.133120 -0.128991 -0.135860 -0.147744 -0.147850 -0.157595 -0.156671 0.034530 0.166734 0.058789 0.336500 0.278661 0.273567 -0.140950
polarizability: 9.46489590e+01 7.15030232e-01 9.39521532e+01 -1.44487824e-03 -3.15211522e-04 3.84061178e+01
1716.lowfreq: -0.0003 0.0004 0.0007 3.7937 8.9189 8.9984 32.9792 81.2012 117.1483
frequency: 32.7771 81.1991 117.1481 157.9075 175.0265 240.0361 256.0900 269.4573 275.6082 304.8234 351.5088 360.2882 389.3670 411.5102 459.7457 473.0885 475.5974 587.0366 627.3424 649.7204 651.9179 679.5893 740.8343 841.5773 856.8956 883.2748 1002.8544 1035.9409 1072.3219 1107.5403 1177.2717 1252.0521 1345.1764 1370.0306 1424.2767 1472.4006 1610.7348 1623.6684 3193.2963
redmass: 18.7193 14.0411 18.5249 17.7078 14.7886 11.8589 17.8154 18.3422 18.6584 17.4187 7.7481 14.2622 12.3537 13.9852 9.1370 17.4829 16.3773 5.4472 17.0225 12.0816 5.9476 10.6081 8.3256 12.4383 1.4642 7.9825 12.8808 12.9634 10.3216 10.6837 1.4736 11.8849 11.6728 11.2986 11.0200 6.6226 8.5570 11.3713 1.0939
irintensity: 0.1101 0.0226 0.0257 0.4981 3.5738 0.5442 0.0638 0.2997 0.5536 0.3776 0.1092 6.9241 0.0289 0.0775 3.1873 1.3472 1.2381 1.7152 32.4722 0.0003 0.8130 11.7630 0.5498 68.2994 32.4721 165.5612 266.8944 62.4242 7.5890 40.7478 58.8943 302.5754 49.5419 26.8339 16.2015 373.7059 8.9840 9.0379 7.2054
temp: 298.150 k
press: 1.00000 atm
elementType: 9 9 9 9 9 9 9 6 6 6 6 6 6 6 1
symmnumber: 1
zpe: 179660.8 jmol-1
zpe.correction: 0.068429 hartree
zpe.thermalcorrener: 0.080388 hartree
zpe.thermalcorrenthalpy: 0.081333 hartree
zpe.thermalcorrgfe: 0.029497 hartree
zpe.sumelectzpe: -965.193570 hartree
zpe.sumelectthermal: -965.181610 hartree
zpe.sumelectthermalent: -965.180666 hartree
zpe.sumelectthermalfe: -965.232501 hartree
dipole: -3.2425 0.0011 -0.0010
dipole: 3.2425
quadrupole: -75.9456 -86.5487 -74.7853
quadrupole: -1.2961 -0.0025 -0.0002
quadrupole: 3.1476 -7.4555 4.3079 -1.2961 -0.0025 -0.0002
hfenergy: -965.2619988 hartree
pointgroup: C01 [X(C7H1F7)]
dipole: -1.2736295 0.0724857 0.0014888 debye
dipolederiv: -0.3410738 0.3386599 0.0001575 0.2950348 -0.7397706 -0.0001167 0.0001976 -0.0002291 -0.0843669 -0.2977612 -0.3110715 0.0002371 -0.2699845 -0.7854356 0.000363 0.0001845 0.0003749 -0.0894987 -0.5121841 -0.2350516 0.0001128 -0.184051 -0.6142425 -0.000067 0.0002057 0.0000387 -0.2722599 -0.5814331 0.1028853 -0.1672323 0.1394587 -0.3567902 0.2025504 -0.1653594 0.1827102 -0.6235883 -0.5809941 0.1023432 0.1672064 0.1388928 -0.3564763 -0.2025284 0.1656175 -0.18269 -0.6245883 -0.4142676 0.3807607 0.0001518 0.3788929 -0.7606624 -0.0001467 0.0001407 -0.0001605 -0.109106 -0.3940375 -0.3643769 0.0003027 -0.3744927 -0.7787806 0.0004329 0.0002734 0.0003992 -0.1069095 -0.5110287 0.0026792 0.0002482 -0.0241064 -0.157477 -0.0000396 0.0000875 -0.0000617 -0.1730022 0.3922948 -0.6243471 -0.000107 -0.223385 0.7647333 0.0000899 -0.0002703 0.0004344 0.1058482 0.3691888 0.6100541 -0.0003496 0.1684486 0.8354756 -0.0002653 -0.0000954 -0.0005683 0.108784 2.0464065 0.0149101 -0.0003342 -0.0408903 1.3253672 0.000032 -0.0006278 0.000011 1.6005716 0.413504 -0.6787917 -0.0000774 -0.410433 0.8109121 0.0001437 -0.0001376 0.0003727 0.0917216 0.3914157 0.6599804 -0.0003699 0.4051242 0.849343 -0.0004639 -0.0002505 -0.0006584 0.0882653 -0.0666886 0.0014522 -0.0000373 0.0012414 -0.1564692 -0.0000031 -0.0000547 -0.0000044 -0.1203176 0.086659 -0.0000862 0.0000912 0.0002496 0.1202733 0.0000189 0.0000888 0.0000314 0.2084469 unknown
polarizability: 94.5650317|-0.750133|94.0360374|-0.0475913|-0.0117267|38.4061609 unknown
InChI: InChI=1S/C7HF7/c8-2-1-3(9)6(11)4(5(2)10)7(12,13)14/h1H
charge 0 multiplicity 1
15 atoms
F  0.454778 -2.385823 0.000065
F  0.352075 2.489728 -0.000796
F  2.61987 1.241889 -0.00195
F  2.491657 -0.709399 1.132843
F  2.489685 -0.708217 -1.138346
F  -2.372028 2.408599 0.001286
F  -2.302242 -2.418261 0.002284
C  0.487718 0.043111 -0.000278
C  -0.230851 -1.179026 0.000495
C  -0.259059 1.244764 -0.000065
C  2.0028 -0.016877 -0.001846
C  -1.671965 1.207502 0.001034
C  -1.638907 -1.197221 0.001572
C  -2.375138 -0.003614 0.001891
H  -3.468093 -0.016757 0.002712
