program: Gaussian 09
title: 000136456
version: EM64L-G09RevD.01
frameworkgroup: C1[X(C4H8N2O4)]
method: RPBEPBE
basis: SDD
operation: Freq
keyword: #pfreq=noraman
keyword: PBEPBE/SDD
title: #p freq=noraman PBEPBE/SDD
converged: YES YES NO NO
title: Mulliken charges:
elementType: O O O O N N C C C C H H H H H H H H
charge: -0.494890 -0.494800 -0.301328 -0.301032 -0.592640 -0.592822 -0.147175 -0.147334 0.184799 0.184432 0.263006 0.262964 0.378988 0.378893 0.334723 0.374747 0.374795 0.334674
chargesum: 0.00000
title: Mulliken charges with hydrogens summed into heavy atoms:
elementType: O O O O N N C C C C
charge: -0.115901 -0.115907 -0.301328 -0.301032 0.116830 0.116647 0.115831 0.115630 0.184799 0.184432
polarizability: 6.76476639e+01 -5.07781152e+00 8.02236922e+01 6.79261213e-03 1.92519912e-04 5.69327906e+01
1716.lowfreq: -16.3271 -11.1862 -7.4470 -0.0007 -0.0003 0.0007 63.7607 74.9335 111.5955
frequency: 63.7482 74.9323 111.5857 215.4841 249.7876 301.4561 307.5538 344.5573 386.2596 457.2631 464.2755 534.9475 592.0163 607.2375 616.5235 627.1359 641.9603 679.4693 728.6637 753.6225 802.1084 813.5983 907.9874 1015.6074 1036.6129 1051.6134 1107.7365 1113.3074 1216.6310 1237.6519 1272.8001 1280.7811 1343.2329 1362.6176 1418.3908 1419.9818 1577.8570 1578.4547 1641.7297 1651.9678 2982.3811 2991.8074 3264.4226 3268.4802 3370.9066 3372.8776 3615.8127 3616.0700
redmass: 5.0602 10.8080 7.4756 5.2037 5.9874 5.0052 4.4949 5.8572 3.8719 3.1627 3.8497 2.8343 3.8837 1.1427 1.1649 2.6142 1.3678 2.1054 3.3081 4.4462 1.1162 1.0893 5.2182 7.7291 5.7279 2.5198 1.9419 1.9434 1.1319 1.1664 1.3058 1.0930 2.1921 2.1108 2.0007 1.8484 1.2412 1.3105 4.9133 6.0475 1.0818 1.0849 1.0635 1.0632 1.0566 1.0564 1.0948 1.0948
irintensity: 2.9515 0.4462 10.6403 5.0655 40.0784 43.9832 34.7609 3.0917 3.5885 19.5596 1.3941 2.9162 49.0971 99.2978 29.3865 68.6677 240.7508 54.4013 50.6842 17.9084 157.0974 220.1501 4.2853 124.7919 0.8479 3.3921 3.9626 0.4301 13.6958 8.9374 7.0618 140.9528 189.0931 35.7891 7.2590 80.9608 162.5848 90.2394 3.3248 485.0625 29.0525 22.3907 83.9327 147.3536 57.6070 250.1991 74.6382 73.8935
temp: 298.150 k
press: 1.00000 atm
elementType: 8 8 8 8 7 7 6 6 6 6 1 1 1 1 1 1 1 1
symmnumber: 1
zpe: 359429.4 jmol-1
zpe.correction: 0.136899 hartree
zpe.thermalcorrener: 0.146806 hartree
zpe.thermalcorrenthalpy: 0.147751 hartree
zpe.thermalcorrgfe: 0.101661 hartree
zpe.sumelectzpe: -566.866956 hartree
zpe.sumelectthermal: -566.857049 hartree
zpe.sumelectthermalent: -566.856105 hartree
zpe.sumelectthermalfe: -566.902194 hartree
dipole: 0.0079 0.0053 -0.0578
dipole: 0.0586
quadrupole: -66.8842 -51.5889 -60.4158
quadrupole: 9.3476 -0.0094 -0.0039
quadrupole: -7.2546 8.0407 -0.7861 9.3476 -0.0094 -0.0039
hfenergy: -567.0038554 hartree
pointgroup: C01 [X(C4H8N2O4)]
dipole: 0.0040471 0.0226463 -0.0014791 debye
dipolederiv: -0.5754491 0.0840526 -0.0495578 0.0648868 -0.5464224 -0.1891551 0.002191 -0.0213802 -0.673266 -0.5792398 -0.0899029 -0.0269565 -0.0616253 -0.5058605 0.1577423 0.0145666 -0.0111915 -0.7085609 -0.5448004 -0.130146 0.2090665 -0.2397127 -0.5150932 0.2069357 0.0335178 -0.013698 -1.0085437 -0.5321962 0.1670337 0.1721143 0.2419269 -0.5834144 -0.2986921 -0.0132271 -0.0716203 -0.9530827 -0.6479032 0.0675584 -0.2741829 0.0443845 -0.4875863 -0.2148588 -0.1045039 -0.1003175 -0.9798242 -0.653031 -0.1121021 -0.2500361 -0.0570223 -0.4406982 0.1174629 -0.0916067 -0.0027939 -1.0230735 0.1955409 -0.210421 0.0891133 -0.2537219 0.1457691 0.036108 0.0765798 0.0712235 0.4259326 0.2104951 0.2217059 0.0466207 0.2614823 0.1201651 0.0204275 0.024926 -0.0143873 0.4363996 0.4935811 0.2877654 -0.0543722 0.4477674 0.501635 -0.0637926 0.0678864 0.081087 1.4292916 0.4699069 -0.2915693 0.0054011 -0.4256328 0.5563463 0.2390332 0.1511368 0.0894186 1.3992406 -0.0522068 0.0740108 -0.0461211 0.06726 -0.0490332 0.0412813 -0.0402613 0.0153422 -0.0004908 -0.0569507 -0.0815272 -0.0321706 -0.073868 -0.0532238 -0.0292276 -0.0268388 -0.0034872 0.0081425 0.3447394 0.0382496 0.0953065 0.0758067 0.3980806 0.1626125 -0.0030628 0.0472342 0.3481319 0.3407721 -0.0179952 0.0952718 -0.0732374 0.3591577 -0.1675381 0.0098257 -0.0492427 0.3898257 0.2809293 -0.0997509 0.0372285 -0.1191388 0.2448834 0.0190474 0.0286549 0.0063299 0.1921086 0.5091808 0.0152021 -0.0197714 0.0372175 0.2988507 -0.0739334 -0.0726003 -0.0588783 0.2716084 0.5083701 -0.0256615 -0.0137837 -0.0578542 0.3257372 0.0645602 -0.0622162 0.0513553 0.2470924 0.2882614 0.1034975 0.0168297 0.1210811 0.230707 -0.0280134 0.0050323 -0.0149938 0.199068 unknown
polarizability: 65.904161|-0.0622059|57.1671041|0.9374959|2.3971444|81.7328815 unknown
InChI: InChI=1S/C4H8N2O4/c5-3(9)1(7)2(8)4(6)10/h1-2,7-8H,5-6H2
charge 0 multiplicity 1
18 atoms
O  0.165144 -1.394596 -1.844062
O  -0.132588 -1.029466 1.860512
O  2.029791 0.414248 -1.558228
O  -1.939483 0.750538 1.224282
N  2.011018 0.388263 0.788653
N  -1.926345 0.271188 -1.073077
C  0.63141 -1.243938 -0.464885
C  -0.597758 -1.132112 0.476604
C  1.619711 -0.045683 -0.440914
C  -1.547406 0.070036 0.218946
H  1.192607 -2.149143 -0.156183
H  -1.188313 -2.061506 0.34626
H  0.828141 -0.859148 -2.385881
H  -0.776176 -0.37865 2.286644
H  2.678629 1.155537 0.866323
H  1.536465 -0.013637 1.610745
H  -1.466182 -0.2977 -1.799117
H  -2.568365 1.030366 -1.30102
