program: Gaussian 09
title: 000011760
version: EM64L-G09RevD.01
frameworkgroup: C1[X(C6H5NO4)]
method: RPBEPBE
basis: SDD
operation: Freq
keyword: #pfreq=noraman
keyword: PBEPBE/SDD
title: #p freq=noraman PBEPBE/SDD
converged: YES YES NO YES
title: Mulliken charges:
elementType: O O O O N C C C C C C H H H H H
charge: -0.380688 -0.378059 -0.286781 -0.146817 0.032025 0.155675 0.183979 0.255871 -0.345002 -0.399312 -0.165915 0.269539 0.231167 0.240860 0.365123 0.368335
chargesum: 0.00000
title: Mulliken charges with hydrogens summed into heavy atoms:
elementType: O O O O N C C C C C C
charge: -0.015565 -0.009724 -0.286781 -0.146817 0.032025 0.155675 0.183979 0.255871 -0.075463 -0.168145 0.074945
polarizability: 1.23895896e+02 -3.23762081e-01 1.16334662e+02 2.69909808e-03 -3.06170295e-03 3.40881054e+01
1716.lowfreq: -7.2587 -0.0003 0.0003 0.0009 9.3265 12.5837 45.0641 113.2200 215.5334
frequency: 45.0526 113.2167 215.5332 255.2800 281.7357 367.5070 377.1303 416.6015 439.7124 474.3858 515.5319 555.8138 573.3110 592.5285 655.4288 707.6291 733.3692 769.3800 796.7739 850.6781 901.0175 968.9578 996.7953 1031.1903 1088.8822 1136.9356 1169.4049 1191.6169 1237.3049 1291.3538 1335.1640 1373.9086 1427.3306 1447.2797 1514.7333 1591.3656 1623.2308 2793.3484 3131.3601 3160.5955 3191.8289 3538.0833
redmass: 10.1640 9.3518 4.4917 5.8154 9.6450 5.6580 9.9688 9.1748 1.2058 3.3803 7.5862 4.7468 7.2803 4.4457 4.1285 6.3115 10.3940 1.5116 7.8881 1.4424 1.0624 1.3164 4.0402 5.7970 2.2001 3.9607 1.2872 1.3765 1.8486 2.7309 4.9112 5.0018 2.6520 2.9986 2.5810 5.0339 5.8204 1.0670 1.0893 1.0929 1.0968 1.0657
irintensity: 1.0571 0.3040 0.0025 4.4586 0.6742 27.3027 1.4563 2.6549 102.9999 24.6238 9.1751 3.1308 6.7270 0.4884 15.7156 1.3654 6.0222 113.9195 11.4353 9.7617 126.4157 0.7817 146.8311 59.6603 24.4554 132.8781 52.0480 51.4297 162.0813 60.3087 80.3570 58.1062 22.7414 267.5421 11.3720 158.2762 174.8096 248.5844 7.8729 9.0568 2.3676 43.6626
temp: 298.150 k
press: 1.00000 atm
elementType: 8 8 8 8 7 6 6 6 6 6 6 1 1 1 1 1
symmnumber: 1
zpe: 280394.4 jmol-1
zpe.correction: 0.106797 hartree
zpe.thermalcorrener: 0.115757 hartree
zpe.thermalcorrenthalpy: 0.116701 hartree
zpe.thermalcorrgfe: 0.072294 hartree
zpe.sumelectzpe: -586.393251 hartree
zpe.sumelectthermal: -586.384291 hartree
zpe.sumelectthermalent: -586.383346 hartree
zpe.sumelectthermalfe: -586.427754 hartree
dipole: 5.8018 1.9313 0.0006
dipole: 6.1148
quadrupole: -63.0727 -59.3146 -64.1673
quadrupole: 6.9199 0.0042 -0.0018
quadrupole: -0.8878 2.8703 -1.9824 6.9199 0.0042 -0.0018
hfenergy: -586.5000472 hartree
pointgroup: C01 [X(C6H5N1O4)]
dipole: -2.195105 0.9832925 0.047059 debye
dipolederiv: -0.6420939 0.3868287 0.0114269 0.2440096 -1.0341225 -0.0173521 0.0084146 -0.0185609 -0.3761527 -0.194388 -0.5095246 -0.0133942 -0.3092849 -1.1534191 -0.0141723 -0.0089684 -0.0119048 -0.3675477 -0.6661954 0.1929601 0.0087162 0.2697014 -0.7908486 -0.0147199 0.0105372 -0.0139594 -0.2946071 -0.6969684 -0.2474574 0.0001201 -0.3202148 -0.5752954 -0.0054022 -0.0014034 -0.0061841 -0.1881464 1.7963718 -0.0054428 -0.018346 0.0287531 1.0958123 0.020347 -0.0175902 0.0207086 0.223346 -1.0429403 -0.0099925 0.0113697 0.040881 -0.367373 -0.0079706 0.0124593 -0.0073021 -0.0388786 0.7703945 -0.6686145 -0.0216555 0.0184948 0.8409049 0.0147819 -0.0062157 0.0225349 0.1571239 0.7222195 0.6013322 0.0070359 -0.1515127 1.0274223 0.0215923 -0.0100025 0.0131556 0.1485667 -0.3986512 0.5921153 0.0151606 0.1293621 -0.235057 -0.0016432 0.0048872 -0.0069979 -0.2239288 -0.5134426 -0.5926725 -0.0102935 -0.1297404 -0.2967102 0.0005796 -0.0001473 0.0058198 -0.2511609 0.2409135 0.0131095 -0.0031284 0.0492246 0.6359553 0.0149854 -0.0021919 0.0154696 -0.0666727 0.0632306 -0.0282089 0.0007109 -0.058157 -0.0016171 -0.0034979 -0.0000392 -0.003854 0.1838053 0.0559346 0.0308049 0.0021989 0.0713416 -0.0894308 -0.0070683 0.0031866 -0.0067152 0.1874351 -0.0845909 -0.0058964 0.0025103 0.0034783 0.1107563 -0.0009662 0.0027365 -0.0008066 0.1524086 0.4636649 0.0663029 0.000502 0.0198241 0.459778 0.0018038 -0.000703 0.0009768 0.371373 0.1265413 0.1843559 0.007066 0.0938392 0.3732445 -0.0012973 0.0050402 -0.0023803 0.3830361 unknown
polarizability: 123.8730046|-0.4112125|116.3040463|-1.0377432|1.8521793|34.1416129 unknown
InChI: InChI=1S/C6H5NO4/c8-4-2-1-3-5(9)6(4)7(10)11/h1-3,8-9H
charge 0 multiplicity 1
16 atoms
O  0.181053 -2.451472 -0.088406
O  0.229865 2.461232 0.020644
O  2.330148 -1.193909 -0.087064
O  2.426461 1.072397 -0.035361
N  1.731486 0.001635 -0.052061
C  0.280474 0.020621 -0.034707
C  -0.444396 -1.23605 -0.054468
C  -0.459018 1.253726 0.001174
C  -1.860396 -1.230708 -0.038284
C  -1.868619 1.221976 0.016332
C  -2.555838 -0.013602 -0.003489
H  -2.373745 -2.194567 -0.054121
H  -2.429039 2.164081 0.044028
H  -3.650434 -0.017664 0.008573
H  1.199456 -2.261704 -0.096809
H  -0.412459 3.217306 0.045019
