program: Gaussian 09
title: 000136449
version: EM64L-G09RevD.01
frameworkgroup: C1[X(C7H15NO)]
method: RPBEPBE
basis: SDD
operation: Freq
keyword: #p
keyword: freq=noraman
keyword: PBEPBE/SDD
title: #p freq=noraman PBEPBE/SDD
converged: YES YES NO NO
title: Mulliken charges:
elementType: O N C C C C C C C H H H H H H H H H H H H H H H
charge: -0.256896 -0.621119 -0.357917 -0.352503 -0.366848 -0.354535 -0.535550 -0.695064 0.224783 0.182166 0.182209 0.190522 0.190441 0.218641 0.219626 0.193138 0.193145 0.232759 0.233314 0.214406 0.210555 0.210574 0.312848 0.331305
chargesum: 0.00000
title: Mulliken charges with hydrogens summed into heavy atoms:
elementType: O N C C C C C C C
charge: -0.256896 0.023033 0.006458 0.028460 0.071419 0.031749 -0.069477 -0.059529 0.224783
polarizability: 1.09098143e+02 -3.94542228e+00 8.33429586e+01 2.99668852e-02 -2.68562883e-02 6.47633520e+01
1716.lowfreq: -27.8898 -2.2284 -0.0003 0.0005 0.0010 10.1993 41.0007 49.3936 72.7172
frequency: -13.6742 48.5933 72.7157 80.2847 115.5361 143.9161 183.4303 226.4597 245.2913 334.8851 433.1497 471.8929 480.9009 514.5161 588.2190 626.3911 725.0173 738.6990 796.3278 833.6025 882.6439 891.7414 981.4062 1006.5650 1033.5132 1060.4080 1072.7416 1085.5195 1105.3157 1121.8221 1192.8938 1218.5244 1242.9927 1262.1486 1280.9249 1289.7168 1296.5831 1305.4935 1342.6356 1357.6868 1369.4955 1390.0984 1445.6491 1463.5600 1466.4809 1473.7500 1476.5937 1482.3271 1489.7663 1596.0502 1644.6104 2948.6160 2958.2843 2963.4463 2968.5142 2972.9823 2987.5939 3000.7090 3003.6886 3011.5030 3031.7541 3064.3150 3069.8631 3071.4194 3515.6441 3672.8888
redmass: 2.4516 3.1118 3.8969 1.7832 2.1357 1.9544 3.8885 1.1294 4.2793 3.1842 3.2729 2.7135 1.3572 1.2854 4.2746 1.4394 1.0718 1.1371 1.2599 3.1580 1.3061 1.8823 1.2154 3.3856 3.1570 2.0179 2.6009 2.0702 1.4239 2.6829 1.6518 1.3549 1.3221 1.4717 1.0799 1.1218 1.0915 1.6079 1.6951 1.6841 2.1936 1.2179 1.0850 1.0716 1.0713 1.0713 1.0422 1.0783 1.0922 1.3991 3.8281 1.0589 1.0588 1.0591 1.0593 1.0363 1.0978 1.0603 1.1008 1.0995 1.1044 1.1035 1.1007 1.0993 1.0444 1.1044
irintensity: 4.6187 0.0048 3.5383 0.5145 0.0046 0.1248 6.8904 0.0000 0.2271 3.7448 3.6281 3.1895 26.2418 217.5450 3.6858 64.0641 17.1055 0.2094 7.4459 0.7175 0.2814 4.6577 2.2353 3.2888 2.0526 7.0947 0.0468 0.6008 0.0883 4.7582 0.1206 4.3622 0.0046 38.2702 0.0128 0.0093 0.9317 53.4196 34.2632 9.6121 73.1196 10.5966 14.2864 0.5287 0.7330 3.3240 12.3684 1.9627 23.7106 66.2377 278.5055 11.3453 2.9281 18.5984 98.1654 35.8783 4.9222 31.3945 2.6813 10.0785 43.6931 42.5094 120.1939 54.2358 24.6856 20.8408
temp: 298.150 k
press: 1.00000 atm
elementType: 8 7 6 6 6 6 6 6 6 1 1 1 1 1 1 1 1 1 1 1 1 1 1 1
symmnumber: 1
zpe: 557643.5 jmol-1
zpe.correction: 0.212395 hartree
zpe.thermalcorrener: 0.223141 hartree
zpe.thermalcorrenthalpy: 0.224085 hartree
zpe.thermalcorrgfe: 0.175350 hartree
zpe.sumelectzpe: -404.990097 hartree
zpe.sumelectthermal: -404.979351 hartree
zpe.sumelectthermalent: -404.978407 hartree
zpe.sumelectthermalfe: -405.027142 hartree
dipole: 0.6194 -3.9508 0.0119
dipole: 3.9990
quadrupole: -48.7304 -59.9545 -57.0373
quadrupole: -12.9970 0.0487 -0.0014
quadrupole: 6.5103 -4.7138 -1.7965 -12.9970 0.0487 -0.0014
hfenergy: -405.2024919 hartree
pointgroup: C01 [X(C7H15N1O1)]
dipole: 0.2172864 1.5582597 0.0038322 debye
dipolederiv: -0.6820469 0.0832669 0.0001478 -0.1472042 -1.0164089 -0.0013306 0.0001216 -0.0014938 -0.3478384 -1.0211823 -0.5027642 -0.0007095 -0.3390924 -0.5046254 0.0009085 0.0000153 0.0009342 -0.7276651 -0.0488221 -0.0118655 -0.0000294 -0.0143242 0.1018326 -0.001671 0.0001635 -0.0016716 0.1997141 -0.048531 -0.0028788 0.0001645 0.0326394 0.0756946 -0.0013319 0.000741 -0.0014582 0.1792072 0.0456176 -0.005678 0.0001665 -0.021931 0.0485523 -0.0006591 -0.0006009 -0.0002066 0.1482614 0.0279302 -0.01054 0.0000159 -0.0595797 0.0988884 -0.0011706 -0.0006662 -0.0010548 0.1783315 -0.2998457 0.0801833 0.0003688 0.2694593 -0.0776595 -0.0025874 0.0030518 -0.0026557 0.1990754 -0.0737195 -0.0541737 -0.0006026 -0.0175766 0.0485577 -0.000554 0.0000011 -0.0005856 0.094514 1.4076809 0.3103032 -0.000856 0.2839547 1.31029 0.0025987 -0.0022639 0.0025714 0.1820154 0.0340292 0.0000743 0.001419 0.0014086 -0.0460117 -0.1180531 0.0033489 -0.1414798 -0.1015458 0.0339502 0.0002623 -0.0015772 0.001764 -0.0535817 0.1193391 -0.0036648 0.1428593 -0.0940134 0.0365068 0.0093295 -0.0072863 0.0002354 -0.0465288 0.1159896 -0.0047849 0.1393385 -0.0862098 0.0365343 0.008892 0.0073132 -0.0000963 -0.0391536 -0.1147287 0.0045755 -0.1380826 -0.0938134 0.052926 -0.0066021 -0.0080152 -0.0104298 -0.0067884 -0.0994238 0.0109366 -0.1038017 -0.0686559 0.0545255 -0.006396 0.0076238 -0.0105233 -0.0116409 0.100311 -0.0112358 0.1042553 -0.0615539 0.0285443 -0.0206585 -0.0190946 0.0060468 -0.0465106 -0.1254238 0.0069198 -0.1521046 -0.0974656 0.0285361 -0.0207856 0.0181685 0.0066072 -0.0545333 0.1266336 -0.0070668 0.1533881 -0.0894924 0.0363837 0.0053882 0.0108456 -0.0260892 -0.0123191 0.100641 0.0135197 0.1266184 -0.0462138 0.0370929 0.0068733 -0.0097174 -0.0246329 -0.0070145 -0.099197 -0.0139823 -0.1250762 -0.0508755 -0.1942031 0.0889228 0.0018001 0.1275118 0.0134962 -0.0015517 0.0024419 -0.0014682 0.0992378 0.08163 0.0041094 0.0271766 -0.0436618 -0.0150042 -0.1202284 -0.0207822 -0.138601 -0.09368 0.0816724 0.0055133 -0.0276856 -0.0437395 -0.0228551 0.1224772 0.0188012 0.140683 -0.0857277 0.2126226 0.023733 0.0002501 0.0221399 0.1066911 -0.0005294 0.0000937 -0.0004258 0.3798354 0.1321678 0.015491 0.0001134 0.0071136 0.1566328 -0.0004582 0.0003162 -0.0004819 0.3845585 unknown
polarizability: 108.9569402|4.3799285|83.4839083|0.0068045|0.0753142|64.7636054 unknown
InChI: InChI=1S/C7H15NO/c1-2-3-4-5-6-7(8)9/h2-6,8H2,1H3
charge 0 multiplicity 1
24 atoms
O  2.949456 -1.353929 -0.004096
N  4.030864 0.693983 -0.001239
C  -0.998584 0.586318 0.002677
C  -2.251426 -0.318301 -0.009516
C  0.322021 -0.214217 -0.009744
C  -3.578777 0.473814 0.003408
C  1.56305 0.69782 0.002545
C  -4.824022 -0.439122 -0.008142
C  2.883304 -0.090152 -0.001465
H  -1.030383 1.239242 0.900911
H  -1.031664 1.265049 -0.876151
H  -2.222337 -0.997351 0.868031
H  -2.22402 -0.971339 -0.906658
H  0.360018 -0.867699 -0.901726
H  0.361875 -0.893158 0.862812
H  -3.604744 1.126255 0.900341
H  -3.606997 1.151665 -0.874396
H  1.546735 1.372563 -0.878328
H  1.542084 1.353965 0.89735
H  -5.760034 0.149239 0.002527
H  -4.836749 -1.079242 -0.910522
H  -4.833356 -1.106244 0.874499
H  3.992574 1.711698 0.000825
H  4.938212 0.22854 -0.002645
