program: Gaussian 09
title: 000136444
version: EM64L-G09RevD.01
frameworkgroup: C1[X(C5H10O2)]
method: RPBEPBE
basis: SDD
operation: Freq
keyword: #pfreq=noraman
keyword: PBEPBE/SDD
title: #p freq=noraman PBEPBE/SDD
converged: NO YES NO NO
title: Mulliken charges:
elementType: O O C C C C C H H H H H H H H H H
charge: -0.242516 -0.242515 -0.377159 0.075675 -0.314463 -0.314462 -0.699318 0.233513 0.198586 0.174630 0.180682 0.232817 0.232816 0.180682 0.219546 0.241938 0.219547
chargesum: 0.00000
title: Mulliken charges with hydrogens summed into heavy atoms:
elementType: O O C C C C C
charge: -0.242516 -0.242515 0.054940 0.250305 0.099036 0.099036 -0.018287
polarizability: 6.94726556e+01 -2.57076000e-05 5.71853871e+01 1.64176011e-01 -1.71455852e-05 5.02508604e+01
1716.lowfreq: -7.5832 0.0004 0.0011 0.0013 17.8357 18.7607 165.4415 183.6204 248.4061
frequency: 165.4415 183.6197 248.4059 303.9559 332.3780 432.3843 452.2714 526.3150 593.9397 774.9535 778.3385 856.6091 884.4303 916.0284 920.1444 1032.6161 1044.2190 1074.4917 1092.7059 1116.3088 1170.5987 1195.2585 1213.9196 1262.5225 1323.3638 1340.0125 1357.0777 1358.7774 1367.7352 1397.2162 1438.6884 1456.4664 1458.2125 1467.7806 1468.9956 2867.9149 2922.5258 2929.5071 2997.0553 3010.4703 3068.1187 3083.1333 3088.5344 3115.1632 3119.9879
redmass: 2.8664 1.0339 2.7734 2.6567 1.7413 3.2105 4.9875 2.9587 2.2753 2.7896 3.0962 2.7717 1.7614 2.8025 2.3322 2.3044 2.3463 2.5390 1.6202 2.3726 2.1202 1.2140 1.3381 1.1489 1.1529 1.3926 1.3499 1.1966 1.3294 1.4059 1.0938 1.0813 1.0435 1.0495 1.0975 1.0834 1.0696 1.0694 1.0613 1.0354 1.0995 1.0937 1.0974 1.1003 1.1004
irintensity: 5.9682 0.0090 2.4071 7.6494 5.4574 0.9878 3.3864 2.0819 4.1919 5.7645 59.2430 5.1661 18.5463 23.2041 15.5966 41.8679 6.8129 104.0160 44.8280 50.6576 4.5652 0.8808 28.4356 16.6157 2.9838 4.1868 14.9764 3.3936 1.2219 50.5661 11.8220 9.6587 8.9752 3.4185 13.4403 80.9838 25.6294 132.0257 33.5048 11.8799 30.3205 41.6312 33.1029 18.3383 22.0884
temp: 298.150 k
press: 1.00000 atm
elementType: 8 8 6 6 6 6 6 1 1 1 1 1 1 1 1 1 1
symmnumber: 1
zpe: 384052.7 jmol-1
zpe.correction: 0.146278 hartree
zpe.thermalcorrener: 0.153189 hartree
zpe.thermalcorrenthalpy: 0.154133 hartree
zpe.thermalcorrgfe: 0.115812 hartree
zpe.sumelectzpe: -346.374307 hartree
zpe.sumelectthermal: -346.367396 hartree
zpe.sumelectthermalent: -346.366452 hartree
zpe.sumelectthermalfe: -346.404773 hartree
dipole: -1.8692 0.0000 1.5452
dipole: 2.4252
quadrupole: -37.6456 -46.3429 -42.5845
quadrupole: 0.0000 0.7283 0.0000
quadrupole: 4.5454 -4.1519 -0.3935 0.0000 0.7283 0.0000
hfenergy: -346.5205852 hartree
pointgroup: C01 [X(C5H10O2)]
dipole: -0.7326061 0.000008 0.6112766 debye
dipolederiv: -0.8954391 -0.2305612 -0.0321076 -0.1754486 -0.7336782 0.0296925 -0.0847801 -0.0385535 -0.4347363 -0.8954531 0.2305557 -0.0321231 0.1754385 -0.7336671 -0.0296699 -0.0847922 0.0385709 -0.4347375 -0.0751092 -0.0000048 -0.0447626 -0.0000045 -0.1483722 0.0000072 -0.0382663 0.0000074 0.0603821 0.8905818 0.0000009 0.0897853 0.0000102 1.0640995 -0.000016 0.2719982 -0.0000102 0.643779 0.6193956 0.1057962 -0.0401482 -0.035713 0.2699669 -0.0411483 -0.07829 -0.0989691 0.3867672 0.6194056 -0.1057927 -0.0401425 0.0357168 0.269973 0.0411574 -0.0782977 0.0989757 0.3867582 -0.2233358 -0.0000036 0.0417792 -0.0000051 0.0195667 0.0000005 0.0633991 0.0000009 0.0266204 0.1029024 0.0000013 0.0122289 -0.0000012 0.0357 -0.0000079 -0.0445541 -0.0000079 -0.1413248 -0.1924813 0.0000001 0.0569856 0.0000025 0.0844213 0. 0.0822246 0.0000002 0.0720567 -0.0353082 0.0000041 0.1018211 -0.0000018 -0.0605053 -0.000006 -0.0613641 -0.0000078 -0.271474 -0.0377209 -0.0076206 -0.0070151 0.0388263 0.063421 -0.0221034 0.0781356 0.077659 -0.2307582 -0.0000867 -0.0740244 -0.0148153 -0.0797751 -0.1100867 -0.0517179 -0.0351353 -0.0852732 0.0637751 -0.0000923 0.0740291 -0.0148231 0.0797756 -0.1100703 0.051732 -0.0351447 0.0852883 0.063763 -0.0377216 0.0076187 -0.0070136 -0.0388233 0.0634161 0.02208 0.0781445 -0.0776806 -0.2307541 0.0315032 0.0733431 -0.0238809 0.1178228 -0.0444201 0.0701217 -0.0338559 0.0746917 0.0738228 0.0974479 -0.0000011 -0.0218961 0.0000016 0.1146737 -0.0000099 0.0344213 -0.0000089 -0.107775 0.0315117 -0.0733409 -0.023872 -0.1178215 -0.0444383 -0.0701122 -0.033843 -0.0746828 0.0738354 unknown
polarizability: 69.4737553|0.0001451|57.1853871|0.0762526|-0.0002784|50.2497607 unknown
InChI: InChI=1S/C5H10O2/c1-5-6-3-2-4-7-5/h5H,2-4H2,1H3
charge 0 multiplicity 1
17 atoms
O  0.332915 -1.213611 -0.185193
O  0.332888 1.21359 -0.185277
C  -1.827018 -0.000042 -0.308296
C  0.9749 0.000013 0.330972
C  -1.091321 -1.254377 0.20696
C  -1.091346 1.254348 0.206861
C  2.420936 0.000018 -0.128317
H  -1.826144 -0.00009 -1.413092
H  -2.87781 -0.000035 0.042661
H  0.866723 0.000051 1.446219
H  -1.167871 -1.313511 1.317554
H  -1.489338 -2.183862 -0.230319
H  -1.489393 2.183782 -0.230499
H  -1.167906 1.313568 1.317448
H  2.935542 -0.899608 0.248175
H  2.456139 -0.000029 -1.229856
H  2.935506 0.899696 0.248099
