program: Gaussian 09
title: 000136439
version: EM64L-G09RevD.01
frameworkgroup: C1[X(C2H5ClO)]
method: RPBEPBE
basis: SDD
operation: Freq
keyword: #p
keyword: freq=noraman
keyword: PBEPBE/SDD
title: #p freq=noraman PBEPBE/SDD
converged: NO NO NO NO
title: Mulliken charges:
elementType: Cl O C C H H H H H
charge: 0.073530 -0.321356 -0.232333 -0.662030 0.219472 0.219472 0.218953 0.242146 0.242146
chargesum: 0.00000
title: Mulliken charges with hydrogens summed into heavy atoms:
elementType: Cl O C C
charge: 0.073530 -0.321356 0.206612 0.041214
polarizability: 6.23964757e+01 -1.66457729e+00 2.78695956e+01 1.04577455e-04 -2.68592016e-05 2.41197775e+01
1716.lowfreq: -0.0055 -0.0045 -0.0029 19.0670 33.2357 34.5790 112.6418 229.3273 229.5297
frequency: 112.1954 229.2666 229.4712 349.8319 649.4236 819.7253 830.5736 995.3385 1101.7983 1132.8576 1225.1446 1339.1781 1384.3908 1450.5638 1479.7821 1494.1190 2981.1874 2992.8428 3044.1097 3089.0309 3118.3415
redmass: 4.2162 1.1127 3.9962 4.5571 8.8982 2.7461 1.0758 3.0529 2.2277 1.3418 1.1987 1.2760 1.2024 1.0406 1.0465 1.0840 1.0535 1.0389 1.1098 1.0956 1.1022
irintensity: 2.0785 0.2342 1.3733 5.7058 8.1513 3.1092 5.3501 15.4031 40.1401 3.7887 0.6312 3.4788 17.9962 13.6415 10.2062 11.3848 40.2167 15.1333 34.6597 20.0543 31.7907
temp: 298.150 k
press: 1.00000 atm
elementType: 17 8 6 6 1 1 1 1 1
symmnumber: 1
zpe: 179734.0 jmol-1
zpe.correction: 0.068457 hartree
zpe.thermalcorrener: 0.073806 hartree
zpe.thermalcorrenthalpy: 0.074750 hartree
zpe.thermalcorrgfe: 0.039886 hartree
zpe.sumelectzpe: -614.086080 hartree
zpe.sumelectthermal: -614.080731 hartree
zpe.sumelectthermalent: -614.079787 hartree
zpe.sumelectthermalfe: -614.114651 hartree
dipole: 2.0968 1.6240 0.0000
dipole: 2.6521
quadrupole: -27.8467 -31.6923 -31.3575
quadrupole: 0.0864 0.0000 0.0000
quadrupole: 2.4522 -1.3935 -1.0587 0.0864 0.0000 0.0000
hfenergy: -614.1545373 hartree
pointgroup: C01 [X(C2H5Cl1O1)]
dipole: 0.8378307 -0.6219244 0.0000012 debye
dipolederiv: -0.5027259 -0.0272798 0.0000018 -0.1561775 -0.0681227 0.0000009 0.0000024 0.0000006 0.0114782 0.2366251 0.1439674 -0.0000028 0.2147199 -0.2683683 -0.0000002 -0.0000021 -0.0000007 -0.3216357 0.2711077 -0.13254 0.0000021 -0.4313124 0.3633707 0.0000014 0.0000028 0.0000002 0.4014096 -0.1945735 -0.0417481 0.0000011 0.2920901 0.0106364 -0.0000017 -0.0000052 0. 0.0603688 0.0129027 -0.0114756 0.0423028 0.0699273 -0.0445959 0.099915 0.0048874 0.1349024 -0.090195 0.0129026 -0.0114778 -0.0423036 0.0699267 -0.0445989 -0.0999159 -0.0048892 -0.1349028 -0.0901913 -0.0833947 0.1008482 -0.0000007 0.0517453 -0.0051696 0.0000027 0.0000019 0.0000029 0.1276276 0.1235766 -0.0101468 0.0006203 -0.0554594 0.0284273 0.1040219 0.0287151 0.1099514 -0.0494338 0.1235793 -0.0101475 -0.0006213 -0.0554598 0.028421 -0.104024 -0.0287131 -0.109954 -0.0494284 unknown
polarizability: 62.3140176|2.3687637|27.9520537|-0.000104|-0.000029|24.1197775 unknown
InChI: InChI=1S/C2H5ClO/c1-2-4-3/h2H2,1H3
charge 0 multiplicity 1
9 atoms
Cl -2.152801 -0.104709 0.00001
O  -0.397336 0.55408 0.000002
C  0.575607 -0.563618 0.000005
C  1.92851 0.164254 -0.000008
H  0.444601 -1.188502 0.904683
H  0.444593 -1.188514 -0.904664
H  2.739901 -0.58911 0.000006
H  2.036859 0.794897 -0.897618
H  2.036866 0.794922 0.897584
