program: Gaussian 09
title: 000136435
version: EM64L-G09RevD.01
frameworkgroup: C1[X(C17H36O)]
method: RPBEPBE
basis: SDD
operation: Freq
keyword: #pfreq=noraman
keyword: PBEPBE/SDD
title: #p freq=noraman PBEPBE/SDD
converged: YES YES NO NO
title: Mulliken charges:
elementType: O C C C C C C C C C C C C C C C C C H H H H H H H H H H H H H H H H H H H H H H H H H H H H H H H H H H H H
charge: -0.460033 -0.075612 -0.405963 -0.439527 -0.394423 -0.398694 -0.378056 -0.383592 -0.383684 -0.381549 -0.372215 -0.373290 -0.353150 -0.353222 -0.356849 -0.356638 -0.696974 -0.696237 0.185608 0.200165 0.213628 0.177743 0.231010 0.190012 0.232891 0.212057 0.193887 0.185659 0.193476 0.191522 0.198123 0.188734 0.194748 0.192084 0.192924 0.190098 0.187729 0.189821 0.190355 0.188291 0.186657 0.188041 0.187952 0.328954 0.195110 0.194222 0.194985 0.194885 0.209188 0.209897 0.214456 0.209723 0.215303 0.209770
chargesum: 0.00000
title: Mulliken charges with hydrogens summed into heavy atoms:
elementType: O C C C C C C C C C C C C C C C C C
charge: -0.131079 0.109996 0.007830 -0.030774 0.028480 0.007250 0.001079 0.006053 -0.000202 0.003459 0.005612 0.006886 0.021798 0.022771 0.032482 0.033231 -0.063433 -0.061441
polarizability: 2.20306803e+02 -7.14419903e-02 1.89755878e+02 2.75759055e-01 -2.05985823e+00 1.61812097e+02
1716.lowfreq: -11.3607 -1.7094 -0.0011 0.0009 0.0013 9.4230 16.5212 26.7145 36.7695
frequency: 10.7041 26.6210 36.6531 38.2399 40.9183 49.5339 59.0294 78.4456 87.7461 91.3071 98.4180 125.1525 132.0455 136.2255 137.4545 139.2020 152.0160 165.3354 184.1162 205.5311 221.3914 229.9094 239.2426 270.2253 302.3699 314.9675 342.3832 381.0919 417.5207 437.9319 456.5921 476.3541 499.8306 589.5477 719.4977 720.1478 725.1553 725.3932 741.1960 744.9210 779.1035 791.1628 827.1915 851.6269 867.4888 886.9186 887.6257 916.1998 934.9477 958.5554 982.2838 989.8101 1002.0146 1007.8338 1014.6690 1024.6006 1035.0726 1039.9166 1053.7783 1068.7913 1075.5119 1079.6519 1080.5717 1084.3519 1091.9747 1101.6125 1115.3842 1125.2632 1145.7907 1184.7307 1185.9433 1202.3980 1212.9088 1219.4163 1224.0314 1233.5149 1252.9849 1254.9413 1262.9871 1266.2566 1280.1411 1281.2625 1283.8978 1286.6686 1288.1760 1292.3104 1293.9782 1296.7902 1298.5817 1300.5257 1319.3258 1332.4592 1341.2408 1351.9653 1354.2331 1354.4662 1356.8117 1359.1615 1367.8680 1387.0421 1387.6768 1388.5434 1457.1986 1459.1845 1460.8873 1461.6044 1462.5911 1463.6175 1465.3698 1466.5702 1470.8755 1472.2916 1475.4424 1476.7167 1477.7445 1479.4489 1484.2286 1485.7194 1488.7079 1489.1474 2916.6535 2948.0131 2948.4470 2949.7182 2950.0688 2950.3596 2952.4123 2952.4862 2956.7953 2959.1279 2962.8089 2964.8900 2968.1274 2968.4404 2970.7894 2971.1107 2982.9922 2983.3711 2983.9372 2989.8263 2991.0666 2999.8582 3003.3514 3011.2730 3018.8046 3023.1213 3026.8253 3034.9527 3037.2510 3043.7142 3053.2808 3067.3598 3067.4704 3069.5723 3069.9766 3555.9254
redmass: 4.0218 2.7144 1.7455 3.6083 1.5884 3.3602 3.6582 2.5890 1.7102 1.7261 2.8072 2.8219 3.0294 2.0412 2.2644 1.8717 2.3408 2.5485 2.8900 3.7077 1.1383 1.1144 3.3030 3.0726 1.1351 2.9211 2.9551 3.3778 2.8927 3.0517 3.0915 2.8117 3.2165 2.5013 1.0616 1.0611 1.0829 1.0875 1.1583 1.1381 1.2938 1.2208 1.8569 1.4049 1.4385 1.8980 1.8698 1.5485 1.3431 1.9455 2.2830 3.5221 3.4194 1.4041 1.4717 3.0662 1.8727 2.7860 2.7152 2.7378 2.4569 2.2321 2.1901 2.0655 1.8897 1.6050 1.9910 2.6418 1.9051 1.7038 1.7705 1.3949 1.2849 1.4054 1.3601 1.3234 1.2963 1.3037 1.2773 1.2438 1.0293 1.0382 1.1732 1.1180 1.2600 1.1054 1.0918 1.1180 1.1251 1.2936 1.3018 1.4231 1.3914 1.5826 1.6195 1.6577 1.6958 1.6549 1.5788 1.2187 1.2192 1.5344 1.0802 1.0789 1.0721 1.0725 1.0690 1.0670 1.0756 1.0730 1.0792 1.0784 1.0428 1.0429 1.0802 1.0806 1.0881 1.0893 1.0935 1.0941 1.0828 1.0590 1.0629 1.0587 1.0587 1.0605 1.0595 1.0592 1.0606 1.0597 1.0603 1.0644 1.0585 1.0588 1.0369 1.0368 1.0955 1.0784 1.0790 1.0976 1.0973 1.0988 1.1003 1.1001 1.1009 1.1020 1.1006 1.1030 1.1045 1.1030 1.1030 1.1007 1.1007 1.0993 1.0993 1.0659
irintensity: 0.0050 0.1517 0.0468 0.1254 0.0190 0.0560 0.1144 0.3669 0.1228 0.2178 0.0715 0.2667 0.8064 0.6385 0.0686 0.5903 0.1578 3.9811 0.5624 0.1221 0.0032 0.0022 0.5203 4.8319 133.8385 3.3104 2.3139 6.0103 4.9190 0.1899 2.3570 1.7724 2.0135 11.7557 15.3673 14.8383 0.1896 0.4033 1.6851 5.1029 5.0042 0.0178 3.2514 0.3569 1.3611 8.5774 3.3348 22.2581 0.4636 28.8907 1.1719 0.7718 2.3342 3.8935 4.3511 6.5082 4.3195 0.0516 1.9462 2.3370 3.2918 1.7232 0.4591 0.1483 25.4378 11.2754 11.9345 12.7287 0.3846 3.8429 0.7046 30.3538 20.3868 1.1217 2.5033 11.2843 2.6293 0.5426 0.7921 4.5126 0.3181 0.2441 0.1756 4.6702 0.1557 0.4635 0.8013 0.4946 1.0605 1.7263 1.2691 4.0020 7.6796 1.2181 0.8949 0.3016 1.6277 2.0744 1.0973 10.3425 10.4495 25.1014 0.7765 5.6722 0.4036 0.0417 0.3178 5.6596 0.4898 0.0302 2.7533 0.8804 12.3856 11.7999 4.7164 1.0161 3.7144 1.1948 42.9604 12.7272 60.9396 5.3694 16.7570 0.3849 0.5094 9.7150 1.1296 0.3426 0.1829 23.6851 46.9012 34.2232 101.0424 223.3547 35.6671 34.7707 0.2815 20.1943 42.2655 2.3980 4.7322 4.4257 4.4215 3.9820 5.5469 3.8651 10.7685 10.8145 71.7428 222.9161 130.4112 95.1087 106.6577 57.2214 53.8613 5.4669
temp: 298.150 k
press: 1.00000 atm
elementType: 8 6 6 6 6 6 6 6 6 6 6 6 6 6 6 6 6 6 1 1 1 1 1 1 1 1 1 1 1 1 1 1 1 1 1 1 1 1 1 1 1 1 1 1 1 1 1 1 1 1 1 1 1 1
symmnumber: 1
zpe: 1303180.9 jmol-1
zpe.correction: 0.496355 hartree
zpe.thermalcorrener: 0.521257 hartree
zpe.thermalcorrenthalpy: 0.522201 hartree
zpe.thermalcorrgfe: 0.437064 hartree
zpe.sumelectzpe: -743.096300 hartree
zpe.sumelectthermal: -743.071399 hartree
zpe.sumelectthermalent: -743.070455 hartree
zpe.sumelectthermalfe: -743.155592 hartree
dipole: -1.9715 -0.2258 0.0836
dipole: 1.9862
quadrupole: -120.0114 -118.7712 -118.0476
quadrupole: -7.6843 1.5744 -0.8054
quadrupole: -1.0680 0.1722 0.8958 -7.6843 1.5744 -0.8054
hfenergy: -743.5926558 hartree
pointgroup: C01 [X(C17H36O1)]
dipole: 0.7751662 0.0923204 0.0349169 debye
polarizability: 220.307754|0.0671352|189.7392461|-0.1608104|2.1685645|161.8277785 unknown
InChI: InChI=1S/C17H36O/c1-3-5-7-9-11-13-15-17(18)16-14-12-10-8-6-4-2/h17-18H,3-16H2,1-2H3
charge 0 multiplicity 1
54 atoms
O  -0.725104 -4.200771 -0.658049
C  0.028814 -3.268782 0.216445
C  -1.040303 -2.4089 0.917936
C  1.076605 -2.482092 -0.602846
C  -1.847699 -1.481831 -0.018248
C  1.932724 -1.51653 0.248076
C  -3.020421 -0.785857 0.708157
C  3.089017 -0.867053 -0.545196
C  -3.826181 0.163631 -0.207393
C  3.92373 0.12017 0.301004
C  -5.005619 0.855606 0.512478
C  5.082058 0.775704 -0.484641
C  -5.812225 1.803064 -0.404578
C  5.910093 1.768209 0.362316
C  -6.991037 2.497224 0.315364
C  7.065263 2.429406 -0.424197
C  -7.792629 3.437723 -0.610861
C  7.884719 3.42251 0.428037
H  0.567144 -3.858732 0.994574
H  -0.551153 -1.81158 1.713367
H  -1.735812 -3.105448 1.426242
H  1.752494 -3.21136 -1.10147
H  0.562876 -1.926939 -1.411089
H  -1.183206 -0.705725 -0.451094
H  -2.233773 -2.081475 -0.864552
H  1.28626 -0.717408 0.663549
H  2.352119 -2.062915 1.119512
H  -2.6319 -0.213784 1.577632
H  -3.700885 -1.558072 1.124066
H  3.753864 -1.661794 -0.943905
H  2.675707 -0.336115 -1.42809
H  -3.146309 0.937137 -0.622755
H  -4.211923 -0.408935 -1.076594
H  4.335488 -0.411408 1.184542
H  3.25708 0.91343 0.699607
H  -5.68517 0.082236 0.928131
H  -4.619065 1.428427 1.381648
H  5.752439 -0.0162 -0.879873
H  4.67057 1.304397 -1.369987
H  -6.201157 1.230392 -1.272598
H  -5.133553 2.576245 -0.822398
H  6.325578 1.240237 1.246279
H  5.239856 2.558941 0.760128
H  -0.07781 -4.763655 -1.154039
H  -7.66717 1.724314 0.734718
H  -6.601302 3.071418 1.180748
H  6.648749 2.954552 -1.308075
H  7.73555 1.639115 -0.82002
H  -7.144458 4.234843 -1.022018
H  -8.21978 2.880468 -1.466118
H  -8.627539 3.924544 -0.07365
H  8.342312 2.914983 1.298327
H  8.698943 3.8860 -0.159054
H  7.241933 4.235633 0.815406
