program: Gaussian 09
title: 000136426
version: EM64L-G09RevD.01
frameworkgroup: C1[X(C8H9Cl)]
method: RPBEPBE
basis: SDD
operation: Freq
keyword: #pfreq=noraman
keyword: PBEPBE/SDD
title: #p freq=noraman PBEPBE/SDD
converged: NO YES NO NO
title: Mulliken charges:
elementType: Cl C C C C C C C C H H H H H H H H H
charge: -0.073350 -0.527277 0.513014 -0.382045 -0.412363 -0.669455 -0.075203 -0.201723 -0.244335 0.212588 0.211080 0.258933 0.236492 0.222895 0.219448 0.224903 0.230149 0.256249
chargesum: 0.00000
title: Mulliken charges with hydrogens summed into heavy atoms:
elementType: Cl C C C C C C C C
charge: -0.073350 -0.103609 0.513014 -0.123112 -0.175871 -0.002209 -0.075203 0.028426 0.011914
polarizability: 1.24405991e+02 3.74005152e+00 9.93714847e+01 -5.42101259e+00 4.61861606e+00 5.01633674e+01
1716.lowfreq: -10.7680 -0.0037 -0.0030 -0.0023 3.6061 9.2216 19.2411 122.6690 182.5887
frequency: 17.4793 122.6662 182.5879 192.5289 244.8720 304.1074 370.8759 393.5876 439.0714 504.6631 584.4530 664.5351 697.9629 782.4316 790.9199 811.3543 889.3147 905.3572 974.1971 976.7419 984.2105 1044.7916 1062.6962 1072.3119 1102.7738 1176.2165 1213.5343 1241.0559 1294.8009 1311.0789 1377.1111 1387.8730 1421.3767 1463.3159 1470.3612 1476.6395 1490.6700 1575.9268 1607.4519 2979.5992 2989.3650 3041.1410 3079.5795 3083.7869 3125.7443 3146.5411 3149.3219 3174.4107
redmass: 2.5900 3.4967 4.8033 1.6877 1.7613 3.3673 3.6485 4.6877 3.0726 4.5854 4.2500 6.6003 2.1431 1.2848 1.3419 3.5652 1.4362 1.3530 2.4315 1.3402 5.7378 1.5453 2.0162 2.1442 1.4075 1.0885 2.2119 1.2666 1.2551 1.4981 7.8225 1.1964 2.5590 2.1378 1.0438 1.1288 1.0963 6.4104 6.8111 1.0347 1.0600 1.1019 1.1002 1.1014 1.0875 1.0926 1.0935 1.0973
irintensity: 0.0767 1.0215 0.0163 0.2175 0.2339 0.4838 3.8508 3.1746 6.7226 0.6146 0.1545 12.8960 29.9521 14.8346 37.7954 46.0131 14.6000 0.4758 5.9019 0.6256 3.4534 2.3258 13.7172 22.1647 1.2449 0.8973 13.8696 0.2329 0.1463 2.5263 1.6865 9.0137 20.5370 20.7639 16.1184 7.6296 13.0336 44.9317 31.1581 35.8195 32.7545 6.7833 53.0157 40.2218 7.9853 13.2510 7.4931 6.4194
temp: 298.150 k
press: 1.00000 atm
elementType: 17 6 6 6 6 6 6 6 6 1 1 1 1 1 1 1 1 1
symmnumber: 1
zpe: 379176.7 jmol-1
zpe.correction: 0.144421 hartree
zpe.thermalcorrener: 0.153182 hartree
zpe.thermalcorrenthalpy: 0.154126 hartree
zpe.thermalcorrgfe: 0.109105 hartree
zpe.sumelectzpe: -769.651677 hartree
zpe.sumelectthermal: -769.642916 hartree
zpe.sumelectthermalent: -769.641972 hartree
zpe.sumelectthermalfe: -769.686993 hartree
dipole: 2.3697 0.9007 -0.0568
dipole: 2.5357
quadrupole: -59.7074 -55.1918 -63.8965
quadrupole: -2.8686 -1.2438 1.4762
quadrupole: -0.1089 4.4068 -4.2980 -2.8686 -1.2438 1.4762
hfenergy: -769.7960978 hartree
pointgroup: C01 [X(C8H9Cl1)]
dipole: -0.8641453 0.4976423 0.0294517 debye
dipolederiv: -0.5727632 0.3276814 0.0321643 0.378651 -0.4323061 -0.0140264 0.0366754 -0.0127563 -0.0878592 0.0022358 -0.054496 -0.0289662 -0.0366863 0.1146064 -0.0132473 -0.1566935 -0.0481449 0.1023732 0.3618459 0.1094426 -0.0253458 0.0596387 0.0913647 -0.008821 -0.0289572 -0.0202028 -0.0686658 -0.396691 0.0724156 0.011565 0.1568271 -0.0848076 -0.0270066 0.0214405 -0.0119531 -0.1289931 -0.1311825 -0.0942275 -0.018107 -0.1778312 -0.0606623 0.0021437 0.0115822 -0.0021395 -0.1730626 -0.0084283 -0.0244959 -0.0351139 -0.0246186 0.0673137 -0.0164288 0.070581 0.0125364 0.0056549 0.8108719 -0.4915279 -0.0689142 -0.5729544 0.6267255 0.0014732 -0.0741225 0.0029007 -0.0277803 0.102233 -0.036785 -0.0332235 0.0340069 0.1256624 -0.0279698 -0.0457021 -0.0222347 -0.121663 -0.1830445 0.1416156 -0.0239843 0.1553375 -0.2553858 -0.0137077 -0.0125733 -0.0099439 -0.1352947 0.0262109 0.018645 -0.0339236 -0.0370231 -0.0704388 0.1353556 0.0068968 0.0921691 -0.0231503 -0.0328485 0.0373695 0.0563507 0.0839646 -0.0465145 -0.1227145 0.0542845 -0.0675121 -0.0012782 0.0993004 -0.0366488 0.0213098 -0.0352022 -0.0390624 0.0266951 0.0195476 0.0279225 0.1453793 -0.036181 0.1130501 0.0253927 0.0967796 0.0175366 0.0037093 0.0258849 -0.0016467 0.1448508 0.1064429 -0.0151584 -0.01043 0.0289259 -0.0738418 0.1310683 -0.0203977 0.0799296 -0.0143785 -0.2204698 -0.1057918 0.012458 -0.1131734 0.0710017 0.0017413 0.0040356 0.0017528 0.062236 0.0441615 0.1108888 0.0632667 0.0706633 -0.0286057 -0.1045094 0.0278404 -0.0705587 0.0070466 0.0638255 -0.027666 0.0167172 -0.0353344 -0.1124884 0.0318974 0.0212556 0.0328014 0.1501306 -0.0355189 -0.0443114 0.0387839 -0.0319709 0.0899024 0.0143476 0.038422 0.0170801 0.1644545 unknown
polarizability: 122.5533922|-7.4425806|101.2253224|-6.4289708|-3.2964822|50.1621282 unknown
InChI: InChI=1S/C8H9Cl/c1-2-7-4-3-5-8(9)6-7/h3-6H,2H2,1H3
charge 0 multiplicity 1
18 atoms
Cl 2.841963 -1.649766 -0.104447
C  -2.317114 -0.450082 0.570017
C  -0.893684 0.034564 0.327944
C  0.176196 -0.895428 0.253425
C  -0.613916 1.411588 0.126908
C  -3.058487 -0.776179 -0.75496
C  1.477395 -0.43462 -0.018828
C  0.700666 1.851646 -0.144911
C  1.768716 0.927666 -0.22223
H  -2.303892 -1.354309 1.20773
H  -2.885791 0.323817 1.120153
H  -0.007501 -1.963809 0.410729
H  -1.430885 2.140401 0.189654
H  -3.114472 0.115329 -1.405702
H  -4.088829 -1.121871 -0.552896
H  -2.531967 -1.568982 -1.316676
H  0.904844 2.91768 -0.294017
H  2.791459 1.255555 -0.428696
